program: Gaussian 09
title: 000041215
version: EM64L-G09RevD.01
frameworkgroup: C1[X(C19H17NO5)]
method: RPBEPBE
basis: SDD
operation: Freq
keyword: #p
keyword: freq=noraman
keyword: PBEPBE/SDD
title: #p freq=noraman PBEPBE/SDD
converged: YES YES NO NO
title: Mulliken charges:
elementType: O O O O O N C C C C C C C C C C C C C C C C C C C H H H H H H H H H H H H H H H H H
charge: -0.265736 -0.317766 -0.417206 -0.220801 -0.397188 -0.295115 0.153468 0.184095 0.182426 0.222581 -0.626965 -0.559126 -0.251267 -0.767688 0.142331 0.312200 -0.377384 0.104439 0.205061 0.143336 -0.301130 -0.348959 -0.272256 -0.190557 -0.536787 0.240401 0.246078 0.270929 0.264332 0.232124 0.233961 0.283238 0.252138 0.281815 0.259492 0.237381 0.235620 0.222897 0.220207 0.244406 0.379636 0.391342
chargesum: 0.00000
title: Mulliken charges with hydrogens summed into heavy atoms:
elementType: O O O O O N C C C C C C C C C C C C C C C C C C C
charge: -0.265736 -0.317766 -0.037570 -0.220801 -0.005846 -0.295115 0.153468 0.184095 0.182426 0.222581 -0.140486 -0.288198 0.013064 -0.018364 0.142331 0.312200 -0.125246 0.104439 0.205061 0.143336 -0.019316 -0.089467 -0.034876 0.045064 0.150722
polarizability: 3.49229795e+02 9.06058413e+00 2.64199759e+02 9.85601267e+00 9.87315977e+00 1.42683864e+02
1716.lowfreq: -4.6419 -0.0006 0.0008 0.0009 3.8122 7.1739 25.2259 31.7940 39.2956
frequency: 25.1602 31.7237 39.2904 42.4843 48.0595 68.0934 84.9938 103.6025 110.3331 131.2526 142.6501 164.3170 172.6099 186.8861 209.5238 231.8814 244.1113 255.7331 274.2850 314.0075 350.1954 385.2110 398.6467 407.8437 417.6238 432.8168 438.9636 465.1395 473.9759 489.6767 509.7933 524.9069 547.1750 552.9439 585.4346 598.6732 620.8551 637.5283 660.5014 669.0736 683.8492 698.8542 735.1318 753.1668 761.2549 770.3159 795.1658 810.9223 835.4422 841.9650 854.5558 867.5249 888.3430 895.6190 911.4003 945.5093 951.6611 962.9706 989.3091 993.8142 1004.2736 1028.6888 1042.0961 1048.3173 1083.3392 1112.8512 1113.6914 1136.1330 1147.8989 1157.8284 1174.1344 1189.1145 1206.5798 1224.5631 1242.2858 1258.7685 1277.5439 1280.8208 1291.4447 1311.8383 1322.1003 1359.4924 1377.9375 1401.1648 1407.2293 1417.3979 1423.6657 1429.4503 1450.3130 1451.9447 1462.9645 1464.9128 1468.5348 1471.0474 1473.3064 1479.6476 1537.5936 1576.6173 1585.7957 1609.0060 1621.5529 1635.8416 1668.6292 2912.7468 2956.5716 2992.1733 3026.8427 3042.7629 3074.4605 3094.2007 3106.0858 3124.1758 3139.2392 3153.7324 3160.7949 3168.4333 3170.7568 3180.0029 3180.8380 3505.7899
redmass: 7.6227 6.9031 8.4946 4.7422 5.7658 4.4872 3.6174 1.2724 2.8541 5.2951 4.6327 4.3737 4.5581 2.7054 4.5100 2.1215 3.6724 3.4460 3.2126 3.6939 5.4361 7.6398 5.4611 2.3105 7.1427 3.9284 3.2828 4.3644 4.3126 5.4217 3.8280 3.5303 4.8069 5.6540 4.0120 2.7109 4.0747 2.9071 2.5008 5.3841 5.9471 4.8009 4.6222 4.6183 2.7689 1.6087 5.9393 1.4315 3.1572 4.5996 2.2875 1.4804 1.0918 2.8713 4.7033 1.3225 2.8178 1.4126 1.3469 4.2844 2.5149 2.2549 1.6520 2.0622 2.2831 1.2680 1.9209 1.4335 1.9926 1.4178 1.1357 1.4949 2.7052 2.1223 2.0665 3.1979 1.5212 2.4975 1.6302 2.0387 2.3456 4.0650 5.2982 5.5481 1.9560 2.4712 2.4929 1.3405 1.1440 1.0585 2.0078 1.0657 1.2011 1.7035 2.2073 1.7851 3.9913 4.0988 7.7785 7.4923 6.9392 5.2907 8.5261 1.0688 1.0331 1.0390 1.0592 1.1037 1.0955 1.1030 1.0985 1.0992 1.0867 1.0898 1.0880 1.0914 1.0955 1.0989 1.0974 1.0639
irintensity: 0.7753 0.2605 0.7762 1.1836 0.3557 3.4240 3.3459 0.0287 0.7786 2.4682 1.9083 1.7819 2.1243 0.8063 0.6297 1.1530 1.6755 2.9964 2.0306 15.9372 0.8997 9.1695 2.3983 3.4686 1.8969 2.5926 8.4709 0.9460 9.8808 1.9456 18.1784 11.6946 41.1321 10.7548 9.3073 75.7141 7.8443 27.5105 73.4267 50.4793 5.2391 6.6794 0.8835 8.1210 33.9495 71.7660 16.2004 26.3024 15.3362 14.5955 35.9560 20.2770 111.4406 2.6397 25.4415 0.4962 23.1163 0.3238 0.9094 15.8367 91.3500 10.8458 69.0425 117.9202 90.4657 0.2233 3.1493 0.4088 53.6404 10.2969 10.9424 21.2053 53.1468 262.6527 42.2953 242.9268 15.1268 11.0379 6.4380 78.0503 427.5418 180.1480 265.4522 66.5064 27.7952 23.4637 30.0165 49.1850 29.8776 13.3181 340.0648 16.4554 28.9841 31.2541 27.9408 7.4764 68.4670 82.1141 4.9799 35.4811 88.1393 112.2030 251.7457 291.7877 69.0187 21.8568 20.1151 47.6181 9.3457 4.1965 17.0104 29.5958 4.4595 7.7057 2.8862 4.5858 9.4989 8.4346 9.9280 21.3025
temp: 298.150 k
press: 1.00000 atm
elementType: 8 8 8 8 8 7 6 6 6 6 6 6 6 6 6 6 6 6 6 6 6 6 6 6 6 1 1 1 1 1 1 1 1 1 1 1 1 1 1 1 1 1
symmnumber: 1
zpe: 839854.5 jmol-1
zpe.correction: 0.319884 hartree
zpe.thermalcorrener: 0.342529 hartree
zpe.thermalcorrenthalpy: 0.343473 hartree
zpe.thermalcorrgfe: 0.266321 hartree
zpe.sumelectzpe: -1163.336408 hartree
zpe.sumelectthermal: -1163.313763 hartree
zpe.sumelectthermalent: -1163.312819 hartree
zpe.sumelectthermalfe: -1163.389971 hartree
dipole: 2.2170 2.6909 2.9592
dipole: 4.5731
quadrupole: -123.5915 -152.8822 -144.6132
quadrupole: -2.7266 -5.1815 -3.5644
quadrupole: 16.7708 -12.5199 -4.2509 -2.7266 -5.1815 -3.5644
hfenergy: -1163.656292 hartree
pointgroup: C01 [X(C19H17N1O5)]
dipole: 0.6654286 -1.0575109 -1.2945728 debye
polarizability: 344.0115613|-17.7526386|265.0988524|-19.9232146|22.5793702|147.0030047 unknown
InChI: InChI=1S/C19H17NO5/c1-11-14(10-18(22)23)15-9-12(25-2)7-8-16(15)20(11)19(24)13-5-3-4-6-17(13)21/h3-9,21-22H,10H2,1-2H3
charge 0 multiplicity 1
42 atoms
O  2.461085 -4.048213 0.055977
O  -1.616613 2.343654 1.2957
O  4.958484 0.646607 0.323177
O  4.28652 2.846969 0.655326
O  -4.058472 1.876198 1.858461
N  -0.300787 0.846449 0.082024
C  1.884583 0.972224 -0.597674
C  1.580126 -0.422366 -0.312809
C  0.215624 -0.491488 0.102472
C  0.752767 1.732805 -0.314098
C  3.207728 1.489594 -1.118745
C  2.382214 -1.59064 -0.353484
C  -0.356134 -1.708064 0.534373
C  0.547582 3.213577 -0.437479
C  -1.565125 1.28676 0.558194
C  1.793285 -2.8109 0.042717
C  0.441045 -2.865246 0.491006
C  -2.793688 0.564424 0.19129
C  4.17716 1.776169 0.023044
C  -4.011477 0.896494 0.894152
C  -2.859168 -0.380301 -0.877164
C  -5.214362 0.208697 0.588843
C  -4.060401 -1.02858 -1.195052
C  -5.234819 -0.743841 -0.442041
C  3.858042 -4.05991 -0.38037
H  3.069861 2.432926 -1.672014
H  3.66329 0.748515 -1.797202
H  3.434616 -1.519989 -0.640174
H  -1.386008 -1.771842 0.893388
H  1.426009 3.675691 -0.915703
H  -0.348443 3.458246 -1.037482
H  0.408488 3.681394 0.551611
H  0.041911 -3.832667 0.80888
H  -1.955117 -0.591813 -1.455698
H  -6.112993 0.465195 1.156863
H  -4.095571 -1.746847 -2.019641
H  -6.172516 -1.257794 -0.680849
H  4.489225 -3.423246 0.270182
H  3.954221 -3.721941 -1.431058
H  4.178067 -5.108904 -0.296911
H  5.53771 0.84829 1.108146
H  -3.141352 2.339413 1.869421
