program: Gaussian 09
title: 000005502
version: EM64L-G09RevD.01
frameworkgroup: C1[X(C22H26N2O4)]
method: RPBEPBE
basis: SDD
operation: Freq
keyword: #p
keyword: freq=noraman
keyword: PBEPBE/SDD
title: #p freq=noraman PBEPBE/SDD
converged: YES YES NO NO
title: Mulliken charges:
elementType: O O O O N N C C C C C C C C C C C C C C C C C C C C C C H H H H H H H H H H H H H H H H H H H H H H H H H H
charge: -0.281977 -0.283573 -0.302190 -0.297128 -0.065154 -0.104785 -0.369449 0.486517 -0.393635 0.258296 0.123318 -0.638414 -0.115011 -0.528842 -0.701898 0.201232 0.209095 -0.798209 0.388402 -0.544439 -0.397234 0.220295 -0.355166 0.171755 -0.514141 -0.537901 -0.529791 -0.529957 0.212155 0.254123 0.213958 0.265727 0.279491 0.232143 0.201948 0.223233 0.234480 0.230664 0.255883 0.297237 0.260455 0.249704 0.213421 0.230220 0.260352 0.243943 0.231862 0.226571 0.231061 0.222113 0.248372 0.223987 0.258876 0.228005
chargesum: 0.00000
title: Mulliken charges with hydrogens summed into heavy atoms:
elementType: O O O O N N C C C C C C C C C C C C C C C C C C C C C C
charge: -0.281977 -0.283573 -0.302190 -0.297128 -0.065154 -0.104785 -0.157294 0.486517 0.074445 0.258296 0.123318 -0.372687 -0.115011 -0.249351 -0.044573 0.201232 0.209095 -0.077182 0.388402 -0.247202 -0.136779 0.220295 -0.105461 0.171755 0.189852 0.164474 0.171755 0.180911
polarizability: 3.98864316e+02 -1.59958418e+01 3.01541913e+02 -5.47813356e-01 -1.87973144e+01 1.98276144e+02
1716.lowfreq: -6.2331 -0.0002 0.0004 0.0006 0.8225 3.7776 24.5104 33.4819 36.6546
frequency: 24.5071 33.4413 36.6298 48.3216 52.6596 55.1049 74.2112 75.1404 103.2555 105.0872 114.6073 123.0648 139.6427 145.8860 154.6760 163.8288 165.0069 172.9648 184.0649 198.0963 202.9802 207.3904 221.8413 242.5745 249.8497 256.0464 264.4296 272.6773 285.6552 314.8445 330.7437 350.2998 358.1696 372.5619 386.8350 424.8383 438.1616 456.3605 474.5053 482.7086 499.0392 506.4482 540.0525 560.7098 578.1371 610.9619 623.7642 639.7291 668.6889 690.4782 704.1427 718.5871 722.7714 741.5008 746.8214 754.6570 809.3448 815.6080 839.1981 853.0108 873.4228 875.5248 894.6685 915.6020 923.8116 933.1156 943.9378 955.3713 962.3603 984.2277 994.7616 1029.2863 1037.3663 1053.5507 1081.5049 1093.4287 1098.0047 1110.7214 1112.3752 1112.9420 1115.1544 1123.5227 1138.9955 1150.5251 1154.4352 1155.6446 1161.3792 1177.8845 1184.8266 1200.5688 1217.3286 1245.9910 1252.3250 1256.2300 1269.2681 1284.6847 1317.1343 1327.9629 1344.3458 1357.5516 1364.4911 1384.5847 1387.7968 1392.6356 1397.1202 1423.8059 1431.2472 1435.6420 1442.0193 1450.5308 1454.4613 1457.1821 1458.2120 1459.3562 1460.5664 1466.5968 1471.2308 1473.6657 1476.9061 1477.4134 1477.7512 1481.5713 1484.3639 1487.6663 1499.3519 1551.4280 1560.8057 1573.8926 1606.1101 1608.3033 2965.0942 2968.6159 2969.1804 2973.2907 2975.8014 2981.9563 2996.3168 2999.1191 3042.4372 3055.5021 3055.9961 3063.0433 3074.5902 3077.1836 3086.4753 3093.5748 3113.2761 3119.2639 3123.2294 3126.1635 3133.5808 3143.3238 3146.6996 3162.1112 3164.8421 3173.4495
redmass: 4.2248 3.2830 4.1824 3.3035 2.4332 3.3853 3.2105 2.8148 2.9381 3.2557 2.9767 3.0661 2.1401 2.4334 2.1037 1.9677 1.1114 1.5989 1.2798 2.1992 2.8132 2.3607 2.7048 2.4607 3.1134 2.1889 4.5227 2.8653 3.2669 4.5911 3.9644 4.2559 4.0302 4.7181 4.3513 4.4262 6.2248 5.6032 4.5310 3.8734 4.2293 4.8769 6.2069 5.4182 5.3995 4.8201 5.8076 6.6243 4.9476 5.8104 6.3600 5.1190 4.6806 1.8501 3.5435 3.8882 3.6742 4.6326 1.5620 2.2502 2.2165 1.7086 1.6440 2.1594 2.6052 2.3960 6.2154 5.7648 1.3378 6.0853 3.1999 1.5204 1.8691 3.2543 2.6952 2.1750 2.5542 1.2379 1.2592 1.2427 1.2415 2.5539 1.7138 1.3712 1.3301 1.4496 1.5811 1.8873 2.6520 2.2920 2.4484 1.8241 1.3525 1.4593 4.2403 1.5565 2.6487 1.6749 1.4714 6.1647 5.1143 1.4575 1.5223 2.2298 3.1404 1.1887 1.2369 1.4664 1.2912 1.0970 1.0758 1.2322 1.3983 1.0644 1.5317 1.0512 1.0811 1.1132 1.1025 1.0557 1.0624 2.5227 1.0656 1.0562 2.7783 8.5375 7.5456 5.7156 6.7357 6.7636 1.0325 1.0308 1.0382 1.0361 1.0310 1.0347 1.0753 1.0748 1.0966 1.1043 1.0968 1.1045 1.1032 1.0987 1.0991 1.0968 1.0980 1.1022 1.1033 1.1001 1.1053 1.0875 1.0912 1.0908 1.0951 1.0923
irintensity: 0.1853 2.5799 0.0673 2.7463 2.2425 1.4119 2.4526 1.6488 7.2308 2.6240 1.3030 7.7895 2.8935 3.3450 1.6243 3.5681 0.2383 0.5148 0.4634 0.9112 2.0528 4.6978 2.9831 3.1595 4.6675 2.8566 10.9484 0.1119 3.5106 13.5625 2.9460 2.2461 0.3904 3.0692 5.6116 1.8367 2.7566 3.7451 5.5501 7.2049 2.6471 6.0328 22.2291 4.3322 3.5723 5.2816 10.8251 22.1822 12.9075 1.7657 2.2539 14.8570 21.0332 3.6466 8.6728 3.1679 33.3917 17.3343 32.7329 17.1632 7.1796 15.1211 15.8812 13.4013 28.2160 36.4125 59.8286 46.3170 2.1817 63.3285 48.9426 1.9934 5.0349 3.2450 50.9293 30.4046 54.2235 11.1929 0.0723 24.1896 2.7594 61.6503 0.7532 1.2613 6.8176 6.2941 10.5274 20.6993 49.8295 12.2222 112.2987 103.1763 7.9136 31.0639 203.6575 58.5835 175.7813 21.3067 4.5459 49.0447 17.2826 23.3732 12.1399 9.1078 38.0044 1.4142 0.9700 21.3455 18.6280 20.0232 22.2215 22.9947 22.8408 8.8134 5.1882 16.8372 3.5002 91.8266 13.9887 33.6871 7.9956 113.2423 14.6992 33.7974 128.1121 49.0590 17.9258 25.4539 18.3252 28.4123 44.7643 85.7766 19.3156 42.7408 93.0086 93.6811 26.5693 22.1604 17.8269 36.3898 8.3659 29.3665 24.2111 36.3673 36.4439 39.5310 11.8115 27.4646 26.3316 24.7804 15.4069 8.4304 4.5275 3.3196 7.3564 1.5784
temp: 298.150 k
press: 1.00000 atm
elementType: 8 8 8 8 7 7 6 6 6 6 6 6 6 6 6 6 6 6 6 6 6 6 6 6 6 6 6 6 1 1 1 1 1 1 1 1 1 1 1 1 1 1 1 1 1 1 1 1 1 1 1 1 1 1
symmnumber: 1
zpe: 1140578.8 jmol-1
zpe.correction: 0.434424 hartree
zpe.thermalcorrener: 0.463474 hartree
zpe.thermalcorrenthalpy: 0.464418 hartree
zpe.thermalcorrgfe: 0.374238 hartree
zpe.sumelectzpe: -1262.162809 hartree
zpe.sumelectthermal: -1262.133759 hartree
zpe.sumelectthermalent: -1262.132814 hartree
zpe.sumelectthermalfe: -1262.222994 hartree
dipole: -0.7953 -3.3357 0.1734
dipole: 3.4336
quadrupole: -143.2752 -155.6773 -164.6500
quadrupole: -5.9582 5.4748 13.4301
quadrupole: 11.2590 -1.1431 -10.1158 -5.9582 5.4748 13.4301
hfenergy: -1262.5972324 hartree
pointgroup: C01 [X(C22H26N2O4)]
dipole: -0.3018304 -1.3164652 -0.0263511 debye
polarizability: 399.1306799|-15.0887298|303.4316421|-1.06025|-11.3134065|196.1200521 unknown
InChI: InChI=1S/C22H26N2O4/c1-7-15-13(2)23-24-22(14-8-9-18(25-3)19(10-14)26-4)17-12-21(28-6)20(27-5)11-16(15)17/h8-12,15H,7H2,1-6H3
charge 0 multiplicity 1
54 atoms
O  -4.75517 -2.129417 0.526136
O  -2.422551 -3.485974 -0.478031
O  4.949974 0.676179 -1.145495
O  5.234998 -1.298539 0.998521
N  -0.988371 2.755462 -1.342867
N  0.122255 2.107345 -0.824841
C  -2.412474 2.196297 0.654798
C  -2.361682 0.696862 0.359592
C  -1.50761 2.689747 1.824274
C  -1.176038 0.072931 -0.145891
C  -2.136151 2.867965 -0.704973
C  -3.523856 -0.091079 0.52442
C  0.072317 0.84815 -0.365278
C  -1.204655 -1.321024 -0.436556
C  -1.706703 4.192646 2.117395
C  -3.55643 -1.46918 0.231788
C  -2.361506 -2.099626 -0.248072
C  -3.251302 3.624161 -1.385383
C  1.401276 0.251083 -0.045827
C  2.559329 0.696834 -0.737825
C  1.55487 -0.728629 0.975527
C  3.832476 0.19226 -0.420425
C  2.832575 -1.219279 1.312241
C  3.981976 -0.756795 0.635345
C  -5.279766 -3.138214 -0.419382
C  -1.196264 -4.149093 -0.933365
C  5.627512 -0.348199 -1.972981
C  6.228055 -0.308209 1.48276
H  -3.451936 2.449364 0.939224
H  -0.443034 2.497914 1.611003
H  -1.769746 2.094637 2.720829
H  -4.449132 0.357924 0.90084
H  -0.291772 -1.78384 -0.821331
H  -1.413297 4.810865 1.249088
H  -2.762448 4.420474 2.36068
H  -1.087392 4.509341 2.975895
H  -3.561288 4.49888 -0.780569
H  -4.14429 2.979254 -1.499952
H  -2.928359 3.972418 -2.378812
H  2.459888 1.442677 -1.531299
H  0.679478 -1.074218 1.534325
H  2.968074 -1.947608 2.118309
H  -5.396011 -2.696771 -1.427614
H  -6.266255 -3.408411 -0.013026
H  -4.6191 -4.016884 -0.470209
H  -1.462375 -5.212715 -1.021099
H  -0.378746 -4.027116 -0.197255
H  -0.871149 -3.762197 -1.918267
H  6.475945 0.170151 -2.445233
H  4.936954 -0.724558 -2.751589
H  5.985088 -1.18922 -1.350796
H  5.876223 0.143463 2.42942
H  6.398356 0.482571 0.730916
H  7.149538 -0.88316 1.660618
