program: Gaussian 09
title: 000041180
version: EM64L-G09RevD.01
frameworkgroup: C1[X(C20H21NO3)]
method: RPBEPBE
basis: SDD
operation: Freq
keyword: #p
keyword: freq=noraman
keyword: PBEPBE/SDD
title: #p freq=noraman PBEPBE/SDD
converged: YES YES NO NO
title: Mulliken charges:
elementType: O O O N C C C C C C C C C C C C C C C C C C C C H H H H H H H H H H H H H H H H H H H H H
charge: -0.266700 -0.407885 -0.234911 -0.056269 0.130871 0.493590 -0.697767 -0.698251 -0.747942 -0.396316 -0.409854 0.330620 -0.398722 -0.404771 0.551871 0.051291 -0.350257 0.030446 0.230581 -0.501248 -0.441076 -0.361916 -0.695529 0.179013 0.210194 0.216494 0.224679 0.215673 0.210236 0.224797 0.218845 0.217618 0.218140 0.230118 0.252190 0.258977 0.268651 0.248453 0.288445 0.238585 0.253555 0.229479 0.245701 0.224066 0.376234
chargesum: 0.00000
title: Mulliken charges with hydrogens summed into heavy atoms:
elementType: O O O N C C C C C C C C C C C C C C C C C C C C
charge: -0.266700 -0.031651 -0.234911 -0.056269 0.130871 0.493590 -0.046400 -0.047546 -0.093339 -0.166198 -0.157664 0.330620 -0.139744 -0.136120 0.551871 0.051291 -0.101804 0.030446 0.230581 -0.212803 -0.202490 -0.108361 0.003717 0.179013
polarizability: 4.40569507e+02 -1.21856246e+01 2.14218958e+02 4.10653105e+00 1.04763403e+01 1.41771559e+02
1716.lowfreq: -17.7355 -4.2202 -1.9074 -0.0009 -0.0004 0.0007 13.7622 24.7784 34.5919
frequency: 6.6457 24.7025 34.5631 41.3872 49.9114 58.5412 72.9501 101.3741 128.8910 177.7992 189.8441 203.6583 210.4955 217.3886 222.6537 239.9324 258.4863 283.1111 291.8809 310.5147 317.1567 347.0074 363.9595 371.2759 380.6158 407.0543 412.2848 429.1954 444.5932 453.8178 513.6339 528.7718 554.8664 563.4359 595.8173 615.3136 622.8180 634.5081 641.9999 685.6859 705.7408 722.2230 754.7034 758.7376 770.5764 801.2667 814.9077 827.1001 833.0705 843.7653 855.8023 860.8775 912.0377 919.9461 924.9582 931.7142 941.3618 945.8135 974.2542 982.3944 991.2787 1001.3321 1013.3179 1021.8162 1023.7641 1034.3122 1064.9665 1096.6084 1108.8362 1118.7656 1124.9084 1136.8409 1177.4597 1200.6890 1202.6284 1215.1963 1219.2587 1237.1175 1258.8531 1266.6057 1271.9671 1304.8007 1312.8076 1347.1141 1364.0609 1374.7820 1378.0646 1389.7214 1398.8825 1405.4338 1415.3396 1431.3634 1459.2484 1460.6429 1464.9633 1466.3955 1472.0187 1473.4732 1476.7436 1485.5294 1487.2653 1498.1517 1552.6693 1569.8597 1609.8619 1619.4564 1629.7918 1660.8693 2973.1095 2974.1251 2978.9542 2993.4863 3047.3532 3069.2710 3069.7150 3070.7076 3078.0492 3078.7259 3081.4468 3091.1260 3106.5405 3132.4303 3139.0651 3148.2307 3161.3429 3164.4315 3170.4496 3177.7480 3504.6069
redmass: 3.3230 5.1961 4.6297 8.0002 5.1427 4.2564 4.7934 5.8743 4.0012 3.7838 2.3510 2.5865 1.8955 1.2038 2.4258 3.7167 1.1075 4.2469 4.0393 1.1021 2.4953 3.0048 4.2473 3.9702 3.8952 2.8673 3.6804 4.2758 3.3945 3.0302 3.7809 5.4315 2.7820 3.5103 3.7714 4.5960 2.0639 6.6594 2.4072 5.7446 4.5713 5.7708 4.5612 3.8891 4.2036 3.2933 2.7310 1.8611 2.7233 10.6491 1.3239 1.5372 1.5493 1.7353 3.0574 1.6547 1.2051 1.3622 9.0113 1.3546 1.3729 2.2417 2.0160 1.7707 1.3935 2.3321 1.6277 2.3210 2.4740 2.1444 1.5552 2.1369 1.9876 1.2171 2.9539 2.6010 2.4104 1.6412 1.5106 3.0343 3.4617 1.6681 1.3152 1.9702 5.1649 1.1835 1.2429 1.1952 3.6136 1.2051 3.3967 3.9898 1.0511 2.3074 1.0483 1.1679 1.1739 1.0566 1.2773 1.5436 1.0505 1.0964 6.2678 7.1627 7.7147 7.2463 7.1583 8.1631 1.0350 1.0345 1.0358 1.0353 1.0851 1.1000 1.1004 1.1005 1.0987 1.0996 1.0993 1.1002 1.1006 1.0878 1.0896 1.0880 1.0933 1.0948 1.0961 1.0961 1.0638
irintensity: 0.0211 0.8413 0.5835 2.1730 0.3607 0.3563 0.4379 0.1706 0.1597 0.4960 0.3278 0.1315 0.0718 0.4595 0.1369 1.1138 0.0823 0.8537 0.3805 0.0966 0.2036 2.0185 4.7090 2.5501 1.1672 0.0030 2.2398 4.0603 3.3834 0.9607 15.9860 4.2467 19.5729 5.9492 17.7288 9.8076 91.3435 3.7355 61.0870 28.2380 31.3219 6.5009 1.2855 0.0268 7.2596 42.0665 28.1118 23.4203 6.2083 20.7353 11.1659 35.5163 16.4559 4.2414 20.3373 2.2172 0.3147 1.3149 68.1720 0.6008 0.1733 17.7869 1.6886 6.2467 0.4012 275.3621 25.2323 45.9042 38.1111 19.2114 6.6650 0.3781 31.6153 5.6863 5.8844 2.0805 11.1063 9.8772 11.6450 3.5279 64.6157 0.8278 1.0349 39.1347 5.2251 18.2517 21.1846 20.1899 9.4786 11.7363 24.9789 31.4877 0.0739 8.8043 1.0594 20.1168 17.4189 11.4965 55.3878 49.8141 12.3199 52.8510 48.4870 17.7658 2.4091 29.7906 35.0329 176.0417 30.9607 32.2602 41.5434 29.1027 7.0104 3.7033 0.2714 17.3038 143.5098 40.5164 46.6023 42.0494 16.7488 23.2250 8.2664 3.9803 0.1334 10.6699 6.9459 6.2835 23.6764
temp: 298.150 k
press: 1.00000 atm
elementType: 8 8 8 7 6 6 6 6 6 6 6 6 6 6 6 6 6 6 6 6 6 6 6 6 1 1 1 1 1 1 1 1 1 1 1 1 1 1 1 1 1 1 1 1 1
symmnumber: 1
zpe: 948618.0 jmol-1
zpe.correction: 0.361310 hartree
zpe.thermalcorrener: 0.383953 hartree
zpe.thermalcorrenthalpy: 0.384897 hartree
zpe.thermalcorrgfe: 0.306628 hartree
zpe.sumelectzpe: -1053.442890 hartree
zpe.sumelectthermal: -1053.420246 hartree
zpe.sumelectthermalent: -1053.419302 hartree
zpe.sumelectthermalfe: -1053.497571 hartree
dipole: 1.2415 2.0888 0.3538
dipole: 2.4555
quadrupole: -109.9769 -139.8467 -140.8944
quadrupole: -9.0092 -1.4267 -1.2720
quadrupole: 20.2625 -9.6074 -10.6551 -9.0092 -1.4267 -1.2720
hfenergy: -1053.8041993 hartree
pointgroup: C01 [X(C20H21N1O3)]
dipole: -0.4811876 -0.8141861 0.197129 debye
polarizability: 440.6121807|-11.1485945|212.421537|-6.447483|-14.9518339|143.5263063 unknown
InChI: InChI=1S/C20H21NO3/c1-12(19(22)23)14-7-10-17-16(11-14)21-18(24-17)13-5-8-15(9-6-13)20(2,3)4/h5-12,22H,1-4H3
charge 0 multiplicity 1
45 atoms
O  0.138804 -1.538104 0.190496
O  6.542761 0.765244 1.60619
O  5.654937 2.39651 0.214016
N  0.516322 0.690894 -0.353638
C  -6.245997 0.367185 0.080158
C  -4.706709 0.232858 0.028125
C  -6.745559 -0.010076 1.508446
C  -6.883252 -0.602564 -0.961276
C  -6.726081 1.806489 -0.238008
C  -4.096355 -1.027964 0.2844
C  -3.848107 1.325951 -0.266162
C  -1.857999 -0.090239 -0.045537
C  -2.701341 -1.195495 0.250686
C  -2.448619 1.17415 -0.304165
C  4.138496 -0.429469 -0.271327
C  -0.408038 -0.227873 -0.089261
C  5.594859 0.013871 -0.490638
C  1.761358 0.018704 -0.259917
C  1.531509 -1.347666 0.074109
C  3.075535 0.492519 -0.437548
C  3.873425 -1.789008 0.069467
C  2.557917 -2.280259 0.247607
C  5.867202 0.403158 -1.966029
C  5.913337 1.191895 0.427999
H  -7.848122 0.064514 1.557246
H  -6.463431 -1.042525 1.782091
H  -6.318136 0.670435 2.267341
H  -6.607338 -1.653957 -0.764796
H  -7.986243 -0.528782 -0.923243
H  -6.554127 -0.351637 -1.986176
H  -7.829502 1.847034 -0.18857
H  -6.332628 2.540712 0.489151
H  -6.425784 2.125087 -1.253431
H  -4.722829 -1.89743 0.513697
H  -4.271386 2.313437 -0.469997
H  -2.254562 -2.174191 0.450719
H  -1.79631 2.023512 -0.531849
H  6.258778 -0.816187 -0.194699
H  3.26346 1.542368 -0.682363
H  4.717097 -2.475794 0.201093
H  2.362161 -3.323269 0.508338
H  5.60424 -0.437284 -2.631005
H  5.265464 1.28151 -2.253547
H  6.932284 0.653721 -2.119117
H  6.692311 1.551014 2.200323
