program: Gaussian 09
title: 000041126
version: EM64L-G09RevD.01
frameworkgroup: C1[X(C8H12O)]
method: RPBEPBE
basis: SDD
operation: Freq
keyword: #pfreq=noraman
keyword: PBEPBE/SDD
title: #p freq=noraman PBEPBE/SDD
converged: YES YES NO NO
title: Mulliken charges:
elementType: O C C C C C C C C H H H H H H H H H H H H
charge: -0.212320 -0.166940 -0.546012 0.273013 0.122229 0.022706 -0.721167 -0.797756 -0.771402 0.247940 0.230496 0.228117 0.215601 0.249438 0.215055 0.236598 0.234467 0.232852 0.241196 0.254866 0.211023
chargesum: 0.00000
title: Mulliken charges with hydrogens summed into heavy atoms:
elementType: O C C C C C C C C
charge: -0.212320 0.080999 -0.087399 0.273013 0.122229 0.022706 -0.041072 -0.093839 -0.064317
polarizability: 9.91314295e+01 7.53741297e+00 1.04269259e+02 -1.20612552e+00 7.25806235e-01 6.02007419e+01
1716.lowfreq: -9.7423 -5.8527 -0.0004 0.0006 0.0009 12.0730 44.9543 57.9063 112.9144
frequency: 44.7173 57.8390 112.9030 125.9914 217.6315 222.5851 265.2804 281.7493 294.2188 368.5292 467.3458 521.9966 544.5074 571.2951 670.3109 732.3005 833.5958 875.5014 899.6250 958.7982 988.9877 997.8224 1044.1440 1067.0481 1098.5039 1114.3728 1123.3342 1180.6715 1197.9605 1234.4061 1282.6732 1300.1205 1336.0617 1384.8310 1395.6100 1402.6999 1452.5823 1455.6096 1460.8298 1463.9115 1470.3688 1472.8574 1480.5845 1613.0198 1668.9744 2964.9155 2970.2898 2981.2094 2982.5883 2987.4778 3018.5750 3035.4947 3061.0263 3076.7051 3089.4142 3091.2686 3093.7137
redmass: 1.0873 2.5042 1.1408 2.3923 2.6136 1.1250 2.8344 2.2282 3.4490 2.6999 2.6242 3.5229 4.5715 3.7545 4.8844 3.4016 2.4118 1.6635 1.7379 1.6653 1.2949 1.7269 1.5215 2.0931 2.3961 2.3559 1.6895 1.4535 2.4445 1.4550 1.5845 2.0931 3.3417 1.1992 1.4026 1.2623 1.0822 1.0621 1.0466 1.0645 1.0748 1.0456 1.0533 10.1040 7.2356 1.0441 1.0554 1.0355 1.0375 1.0846 1.0985 1.0956 1.0956 1.1003 1.0998 1.0992 1.0977
irintensity: 1.1492 1.0205 0.1063 2.0274 1.6942 0.1049 3.4382 3.4024 5.8712 1.0075 2.2937 0.3837 5.5006 3.1643 1.0379 3.5877 4.8892 2.4476 4.3523 2.6234 13.5715 19.0317 2.0551 14.6362 12.3503 6.5641 5.9933 0.1062 17.4037 0.2173 2.5063 5.7098 45.7427 15.2092 41.3903 15.1949 6.4157 9.5463 16.4433 24.2599 4.1777 14.4999 7.6840 260.6861 10.2383 7.3547 50.0729 44.7539 14.7613 3.7325 21.1471 20.3585 15.8584 39.4783 15.9961 11.8257 29.1296
temp: 298.150 k
press: 1.00000 atm
elementType: 8 6 6 6 6 6 6 6 6 1 1 1 1 1 1 1 1 1 1 1 1
symmnumber: 1
zpe: 467185.9 jmol-1
zpe.correction: 0.177942 hartree
zpe.thermalcorrener: 0.188208 hartree
zpe.thermalcorrenthalpy: 0.189152 hartree
zpe.thermalcorrgfe: 0.141965 hartree
zpe.sumelectzpe: -386.579123 hartree
zpe.sumelectthermal: -386.568857 hartree
zpe.sumelectthermalent: -386.567912 hartree
zpe.sumelectthermalfe: -386.615099 hartree
dipole: -2.4020 -3.5852 -0.0348
dipole: 4.3156
quadrupole: -53.3291 -58.4982 -54.1282
quadrupole: -4.8472 -0.2768 0.8159
quadrupole: 1.9894 -3.1797 1.1903 -4.8472 -0.2768 0.8159
hfenergy: -386.7570647 hartree
pointgroup: C01 [X(C8H12O1)]
dipole: 0.9925648 -1.3768246 0.0446775 debye
dipolederiv: -0.7364271 0.3192859 0.0118519 0.3017659 -0.9641536 0.0012401 0.0131327 0.0201557 -0.3365813 -0.1182212 -0.1963774 0.004658 -0.1611151 -0.2541602 0.0376176 0.0001088 0.0806406 0.1085719 -0.1576294 0.004475 0.0115382 -0.0441797 -0.079305 -0.004867 0.0074757 -0.0358798 0.1670375 0.3559211 -0.1103815 -0.031779 -0.3405227 0.4341091 0.0077942 -0.0155395 -0.0178413 -0.0903088 -0.6022085 0.5395004 0.0144985 0.3700857 -0.0951435 -0.0302317 0.0467054 -0.0248836 -0.0733621 1.1671145 -0.5046777 -0.0739812 -0.1459021 0.9684731 -0.0329606 -0.1339948 -0.0599497 0.112149 0.05554 0.0585211 -0.0470532 -0.0007453 0.0630657 -0.0151519 0.0057133 0.0180128 0.0690628 -0.1921314 0.0585743 0.0117835 0.1502396 -0.0621671 -0.0033199 -0.0052574 0.0268529 0.0677445 -0.0084854 -0.0908038 -0.002181 -0.0808938 -0.1193702 0.0269019 -0.0044402 0.0014649 0.0852806 0.0405971 0.0097235 0.0435316 -0.0068102 0.0642937 -0.0021831 0.0545564 -0.0082868 -0.1061529 0.06342 -0.0576571 -0.0066173 -0.0105983 -0.0277067 -0.0805682 -0.0056522 -0.1400085 -0.0467256 0.0486611 -0.0091153 -0.0269148 0.0262516 -0.0282808 0.09822 -0.0246814 0.1606519 -0.0438895 0.0034096 -0.0933887 -0.0040135 -0.1508894 -0.1071929 0.0331606 0.0008917 0.0489321 0.0629918 -0.0234492 0.0630789 -0.004294 0.1546817 0.0075341 -0.0051521 0.0022461 -0.0259461 0.0911463 0.0391948 0.0048643 0.1021877 -0.0062724 0.080301 -0.0113065 0.0230098 -0.0220204 -0.1365818 0.0443929 0.0583188 -0.0071472 0.0389617 0.0424158 0.0915241 -0.0627537 0.1157738 -0.0542858 -0.0616536 -0.0699252 0.0280797 -0.1501309 0.0028192 0.0351184 0.0463014 0.0165967 0.0956708 0.0575925 0.016119 -0.0258876 0.0213564 -0.0185578 -0.1167108 0.0428412 -0.1491067 -0.0077245 0.0857594 -0.0492663 0.0069642 -0.0453187 0.0107979 -0.0712672 -0.0334569 -0.1089716 -0.0591453 0.0706145 0.0546413 -0.078168 0.0050818 0.0160075 0.0777589 -0.0280183 0.1034652 0.017476 -0.1320115 -0.0055094 0.0729436 0.0749541 0.0662207 -0.0356167 0.0708118 0.0003479 0.0776264 unknown
polarizability: 99.6873054|-7.6828762|103.7261545|-0.340495|-1.2816913|60.1879708 unknown
InChI: InChI=1S/C8H12O/c1-5-4-6(2)8(9)7(5)3/h6H,4H2,1-3H3
charge 0 multiplicity 1
21 atoms
O  -1.366074 1.856139 0.076863
C  -1.323069 -0.625884 0.358556
C  -0.116186 -1.590457 0.206876
C  1.105215 -0.690701 0.032179
C  0.763146 0.641141 -0.015547
C  -0.711248 0.776158 0.13259
C  -2.512966 -0.894517 -0.588609
C  2.480018 -1.290108 -0.078597
C  1.636024 1.853309 -0.200296
H  -1.696155 -0.647986 1.402469
H  -0.23605 -2.248364 -0.678053
H  0.006921 -2.264557 1.077322
H  -3.00203 -1.856965 -0.352475
H  -3.259341 -0.086309 -0.49425
H  -2.17872 -0.926327 -1.642246
H  2.751836 -1.817135 0.857795
H  3.257471 -0.535064 -0.280477
H  2.514665 -2.050077 -0.883677
H  1.727232 2.418546 0.746741
H  1.17169 2.543685 -0.927252
H  2.65152 1.598173 -0.547511
