program: Gaussian 09
title: 000005407
version: EM64L-G09RevD.01
frameworkgroup: C1[X(C19H24O3)]
method: RPBEPBE
basis: SDD
operation: Freq
keyword: #pfreq=noraman
keyword: PBEPBE/SDD
title: #p freq=noraman PBEPBE/SDD
converged: NO YES NO NO
title: Mulliken charges:
elementType: O O O C C C C C C C C C C C C C C C C C C C H H H H H H H H H H H H H H H H H H H H H H H H
charge: -0.251395 -0.222867 -0.249957 -0.073326 -0.108134 -0.201290 0.387402 0.136256 -0.487614 -0.513737 -0.490451 -0.498532 0.567192 -0.648337 -0.763957 -0.780788 -0.182648 -0.538950 0.178845 -0.642847 -0.410293 0.178700 0.235915 0.227590 0.225492 0.245630 0.212329 0.205439 0.233446 0.219644 0.223334 0.233131 0.232056 0.223887 0.236443 0.241802 0.228208 0.219488 0.238472 0.246304 0.224535 0.233262 0.258968 0.253874 0.263516 0.253961
chargesum: 0.00000
title: Mulliken charges with hydrogens summed into heavy atoms:
elementType: O O O C C C C C C C C C C C C C C C C C C C
charge: -0.251395 -0.222867 -0.249957 0.162588 0.119456 0.024202 0.387402 0.136256 -0.029655 -0.074852 -0.047473 -0.033344 0.567192 -0.188007 -0.074458 -0.071477 0.050614 -0.026107 0.178845 -0.379330 -0.156332 0.178700
polarizability: 2.69141423e+02 -5.58955305e+00 1.85307423e+02 -2.09958945e+01 -4.22198332e-01 1.64045021e+02
1716.lowfreq: -10.5498 -6.3551 0.0006 0.0007 0.0008 19.1223 31.2718 36.1325 49.1117
frequency: 31.1192 35.9897 48.6758 90.3178 113.3020 130.2562 161.4131 177.0676 193.3624 212.8313 222.3384 237.2530 250.9986 268.5793 286.4604 298.1959 321.1342 342.0471 350.6035 360.2767 404.3275 415.0766 438.9706 456.3135 461.6113 471.0456 479.3169 496.4222 507.3744 522.5210 528.6767 546.2471 585.3039 622.7620 658.8270 680.1149 694.8384 721.2198 747.1370 788.6768 810.7232 821.6780 839.5296 850.7449 864.4305 883.7114 904.6564 910.1834 920.4074 935.1671 949.1631 952.7159 955.4909 968.4713 995.9475 1008.0810 1014.8446 1031.6093 1046.4032 1067.1969 1073.1634 1079.0745 1097.5720 1109.3293 1114.2074 1129.7042 1139.4024 1155.9211 1156.8726 1170.6393 1184.2207 1194.6014 1204.3639 1228.4321 1234.8231 1243.2252 1255.5551 1276.4259 1278.8220 1289.1113 1301.0142 1306.6662 1318.1125 1320.9763 1332.1354 1337.3646 1345.9898 1348.2004 1353.2396 1355.6605 1364.9356 1382.0757 1389.3845 1393.1612 1446.9109 1447.7540 1462.0321 1463.4137 1464.5727 1469.0802 1474.6115 1479.5703 1485.4386 1505.7737 1560.5542 1611.8881 1648.9804 1660.9780 2941.6238 2962.9958 2969.7836 2974.0189 2981.0574 2985.1335 2990.8826 2992.6716 2996.9491 3001.2979 3019.1694 3041.9757 3049.7895 3051.3498 3058.3718 3062.4428 3069.2511 3087.2300 3090.5016 3092.0193 3095.9915 3110.8498 3130.0421 3151.7093
redmass: 7.4646 4.7075 7.4437 4.3234 2.9963 2.8850 3.7547 1.1614 3.9329 2.0261 2.3474 2.0217 2.0202 3.2853 2.2605 3.3767 2.6207 3.9513 2.6131 3.0106 3.5677 3.2855 2.6326 3.6767 3.6630 3.3091 3.4760 3.6553 3.9124 3.1289 3.1712 3.0729 3.6438 4.2276 3.6786 3.8861 3.0661 2.8289 2.9560 2.3039 2.1972 1.6636 1.8587 2.7309 3.7265 2.6048 2.2718 1.7273 2.0913 1.8346 1.7863 1.9584 2.1753 2.0656 1.3170 2.0600 2.0236 2.3399 2.2796 2.2209 2.1713 2.0503 2.2191 1.8934 1.9172 1.9704 2.6654 1.8960 1.6610 1.4903 2.1352 2.0873 1.3404 1.5331 1.5639 1.4790 1.5519 1.3319 1.3861 2.1157 1.4278 1.3278 1.4797 1.4109 1.4527 1.4440 1.4283 1.4085 1.8451 1.5302 1.7464 1.7338 1.2071 1.3821 1.0736 1.0840 1.0819 1.0648 1.0929 1.0834 1.0595 1.0658 1.0609 1.0719 8.7602 8.5690 12.1341 7.4012 1.0812 1.0794 1.0694 1.0636 1.0753 1.0601 1.0414 1.0357 1.0653 1.0600 1.0638 1.0974 1.0993 1.0977 1.0954 1.1029 1.0993 1.0984 1.0997 1.1001 1.0992 1.0855 1.0919 1.0977
irintensity: 6.2278 3.7528 1.2497 0.5960 4.1898 1.0015 0.2986 0.1186 1.3071 1.7993 1.4624 0.7325 0.7929 0.1865 0.4671 2.3529 0.4087 6.1736 1.5326 2.6817 2.3225 1.9513 2.5270 0.5394 4.6656 2.3006 0.9846 1.1737 6.8669 5.2351 4.0054 1.2892 2.7755 0.4171 0.2349 9.2331 9.0324 13.3641 1.4509 2.2598 14.7993 13.0664 6.2098 10.6730 22.5225 2.9974 5.5651 40.4363 15.9784 33.1214 8.1056 43.8277 12.1170 2.3374 1.3179 4.8076 63.5735 32.4047 3.2218 21.3762 38.4274 11.6320 4.6408 2.2858 5.1794 15.4283 63.2864 15.9604 5.5748 16.4479 21.2914 51.6146 26.0907 5.0492 29.9760 7.5655 9.7037 0.1144 1.9667 25.3807 1.8949 1.6654 6.9071 5.0161 0.8054 3.1267 0.9858 6.1269 1.2136 2.5322 5.9760 22.7317 13.8912 15.3632 11.8359 8.7102 12.4633 6.8882 21.6832 10.4254 7.9446 3.1762 6.0260 23.9693 183.1815 13.2988 347.1654 144.8157 7.7260 0.4553 22.4756 14.1350 21.3914 21.4896 32.2331 23.8669 13.9115 27.2406 43.9395 40.0568 35.2003 17.2376 24.7408 32.7164 27.6248 31.1198 25.6059 16.5407 23.0462 14.5913 10.3390 15.7659
temp: 298.150 k
press: 1.00000 atm
elementType: 8 8 8 6 6 6 6 6 6 6 6 6 6 6 6 6 6 6 6 6 6 6 1 1 1 1 1 1 1 1 1 1 1 1 1 1 1 1 1 1 1 1 1 1 1 1
symmnumber: 1
zpe: 1020673.1 jmol-1
zpe.correction: 0.388754 hartree
zpe.thermalcorrener: 0.408384 hartree
zpe.thermalcorrenthalpy: 0.409328 hartree
zpe.thermalcorrgfe: 0.341698 hartree
zpe.sumelectzpe: -962.437241 hartree
zpe.sumelectthermal: -962.417611 hartree
zpe.sumelectthermalent: -962.416667 hartree
zpe.sumelectthermalfe: -962.484297 hartree
dipole: -2.9959 0.8816 -2.5582
dipole: 4.0370
quadrupole: -188.8787 -119.7401 -135.9542
quadrupole: -4.9439 27.4351 0.3754
quadrupole: -40.6877 28.4509 12.2368 -4.9439 27.4351 0.3754
hfenergy: -962.825995 hartree
pointgroup: C01 [X(C19H24O3)]
dipole: -1.173625 -0.3721962 1.0033357 debye
polarizability: 269.3727809|4.9705828|185.3069409|20.5712335|0.0923061|163.8141445 unknown
InChI: InChI=1S/C19H24O3/c1-18-9-7-13(20)11-12(18)3-4-14-15(18)8-10-19(2)16(14)5-6-17(21)22-19/h7,9,11,14-16H,3-6,8,10H2,1-2H3
charge 0 multiplicity 1
46 atoms
O  -3.18508 0.855365 -0.542402
O  -4.54084 -0.286366 -1.969622
O  5.739978 -0.034066 0.823934
C  -0.541594 -0.652236 0.191089
C  0.427874 0.571666 0.142258
C  -1.754689 -0.357939 1.139424
C  -2.484372 0.973071 0.807195
C  1.754931 0.294607 -0.699779
C  -0.349539 1.819028 -0.34375
C  -1.509573 2.148201 0.611348
C  0.192894 -1.943019 0.6297
C  -2.803601 -1.500007 1.15064
C  2.369571 -1.017681 -0.211626
C  1.452994 -2.220161 -0.231651
C  -3.569585 1.361634 1.831504
C  1.443277 0.179073 -2.234108
C  2.70973 1.464352 -0.536378
C  -3.498843 -1.63464 -0.221777
C  -3.810797 -0.327186 -0.958308
C  3.64859 -1.101291 0.269611
C  3.982016 1.364909 -0.057865
C  4.54863 0.065814 0.378828
H  -0.932288 -0.806874 -0.836694
H  0.770233 0.76321 1.1842
H  -1.348712 -0.244544 2.16689
H  -0.763091 1.640752 -1.353818
H  0.312016 2.701364 -0.409721
H  -1.111547 2.431824 1.606366
H  -2.084464 3.011014 0.22811
H  -0.479645 -2.817577 0.558653
H  0.495124 -1.850448 1.693136
H  -3.554472 -1.295192 1.934139
H  -2.340416 -2.462647 1.42767
H  1.131682 -2.447831 -1.268361
H  1.981995 -3.113158 0.146493
H  -3.99454 2.34407 1.562757
H  -4.402453 0.639523 1.861956
H  -3.136398 1.435723 2.846006
H  1.113126 1.149838 -2.641872
H  2.352459 -0.125374 -2.781115
H  0.651443 -0.561113 -2.441663
H  2.338921 2.441532 -0.872614
H  -4.447731 -2.193799 -0.143406
H  -2.867962 -2.218778 -0.920702
H  4.059813 -2.058769 0.612882
H  4.641436 2.237228 0.018846
