program: Gaussian 09
title: 000041092
version: EM64L-G09RevD.01
frameworkgroup: C1[X(C9H14O)]
method: RPBEPBE
basis: SDD
operation: Freq
keyword: #pfreq=noraman
keyword: PBEPBE/SDD
title: #p freq=noraman PBEPBE/SDD
converged: YES YES NO NO
title: Mulliken charges:
elementType: O C C C C C C C C C H H H H H H H H H H H H H H
charge: -0.210357 -0.182165 -0.191222 0.292954 0.113417 0.004762 -0.739898 -0.724131 -0.822939 -0.775873 0.227693 0.243199 0.224923 0.223989 0.221262 0.215402 0.249072 0.212699 0.234140 0.233749 0.242202 0.210433 0.256020 0.240669
chargesum: 0.00000
title: Mulliken charges with hydrogens summed into heavy atoms:
elementType: O C C C C C C C C C
charge: -0.210357 0.045528 0.051977 0.292954 0.113417 0.004762 -0.069725 -0.046958 -0.112848 -0.068750
polarizability: 1.05508322e+02 -4.53835815e+00 1.20195247e+02 -1.49263594e+00 4.21371144e+00 7.04983419e+01
1716.lowfreq: -32.5289 -8.8497 -0.0004 0.0006 0.0006 10.2072 14.2152 44.1531 104.5615
frequency: -32.1940 44.0980 104.5594 122.7257 189.2180 204.4798 222.8461 235.0848 260.1662 279.0241 308.0199 342.0080 414.1005 521.5302 538.2981 554.4670 568.9117 669.1534 734.4599 815.6354 844.4552 934.5183 977.8438 989.0793 1001.7012 1033.7844 1044.0051 1071.6545 1085.2135 1112.5255 1118.0110 1158.8711 1197.4728 1239.3217 1265.1135 1295.6254 1307.5619 1332.7755 1383.9279 1388.7833 1395.7779 1402.2033 1453.7483 1461.5410 1462.4061 1469.4791 1471.5420 1475.5248 1479.1903 1483.1585 1610.7856 1660.6023 2943.9779 2968.1494 2974.0882 2977.0266 2980.7524 2982.5988 3037.4491 3059.7652 3074.0696 3074.5472 3075.5689 3089.1030 3091.6737 3095.2248
redmass: 1.0252 3.2402 2.6633 1.1321 2.8746 1.1649 1.6751 1.3584 2.3162 2.2640 3.6181 3.2268 3.1982 4.0270 3.4416 4.7524 3.4411 3.0051 3.3105 2.1407 2.0349 1.6961 1.2378 1.4359 1.6234 1.8535 1.6908 2.3789 2.1557 2.5274 2.3776 1.8128 2.1773 1.3715 1.3320 2.3284 1.6889 3.5415 1.2043 1.2118 1.3903 1.2562 1.0545 1.0467 1.0588 1.0763 1.0474 1.0534 1.0552 1.0501 10.0027 7.7674 1.0821 1.0391 1.0782 1.0392 1.0353 1.0379 1.0953 1.0951 1.1000 1.1001 1.0998 1.0996 1.0979 1.0986
irintensity: 0.6843 1.5910 1.1210 1.7255 0.1335 0.6719 0.9236 0.6867 2.1873 1.9497 3.6608 3.0769 0.9209 0.9315 1.3178 6.9373 3.7679 3.2562 2.4619 3.0103 1.0657 6.6704 7.2432 22.5749 5.8336 4.1303 6.1699 2.0072 11.9421 7.3449 8.5158 7.4508 10.5257 0.1958 1.6701 9.3636 1.1502 37.0847 19.4341 13.0172 38.5662 14.1267 6.9134 20.5162 20.7157 7.7714 10.5334 4.2594 14.8367 3.8071 266.7423 8.2927 14.5649 20.6385 10.8605 39.5359 41.1520 15.8419 16.0881 15.2863 17.2709 30.1789 53.9256 18.2640 15.3202 24.6630
temp: 298.150 k
press: 1.00000 atm
elementType: 8 6 6 6 6 6 6 6 6 6 1 1 1 1 1 1 1 1 1 1 1 1 1 1
symmnumber: 1
zpe: 539282.4 jmol-1
zpe.correction: 0.205402 hartree
zpe.thermalcorrener: 0.216301 hartree
zpe.thermalcorrenthalpy: 0.217245 hartree
zpe.thermalcorrgfe: 0.169192 hartree
zpe.sumelectzpe: -425.803373 hartree
zpe.sumelectthermal: -425.792474 hartree
zpe.sumelectthermalent: -425.791530 hartree
zpe.sumelectthermalfe: -425.839583 hartree
dipole: -1.6817 3.9838 0.5513
dipole: 4.3592
quadrupole: -57.9891 -68.6103 -60.9304
quadrupole: 4.0169 0.0479 -1.0242
quadrupole: 4.5208 -6.1003 1.5795 4.0169 0.0479 -1.0242
hfenergy: -426.0087747 hartree
pointgroup: C01 [X(C9H14O1)]
dipole: -1.3229086 1.0870514 0.0978043 debye
dipolederiv: -0.9063218 0.3467688 0.0434362 0.3248261 -0.8051753 -0.0331531 0.0484051 -0.0352053 -0.3368945 -0.0693811 0.0182062 0.0072893 -0.0419264 -0.0206931 -0.0026848 0.004416 -0.0494275 0.1557351 -0.052396 -0.117476 -0.0126064 -0.0741636 -0.369253 0.0099987 -0.0298289 0.0571913 0.106585 0.436317 -0.0848669 -0.0754071 -0.3151078 0.2688168 0.0527402 -0.0867471 0.113269 -0.0913723 -0.7782711 0.3373258 0.0702198 0.1741814 0.1147749 0.012446 0.0774558 0.0024046 -0.0724119 1.2967108 -0.4122209 -0.1132601 -0.0598035 0.8319662 0.0177851 -0.1200924 -0.0035962 0.0993383 0.067729 -0.0625539 -0.0185266 0.0071258 0.0093455 0.0650545 -0.0169742 0.0207102 0.0555994 0.0380088 0.0565224 -0.0352811 -0.0095679 0.063453 -0.0245271 -0.0020672 0.008 0.0757685 -0.2435676 0.0140543 0.0215801 0.1001465 -0.0353895 -0.0064083 0.0117776 0.001168 0.0631351 0.0268175 -0.0469546 -0.0177334 -0.0382208 -0.1679815 -0.002823 -0.0087909 -0.0388953 0.0866938 0.0643696 -0.0325746 -0.0025972 0.0161957 -0.0355876 -0.0526044 0.0122853 -0.0760618 -0.1300157 0.056097 -0.0107677 0.0213683 -0.024726 0.0495861 0.0351835 0.0321038 0.0300647 -0.107595 -0.0145525 -0.1558391 0.0070592 -0.0908168 -0.0900135 0.0161404 -0.0176114 0.0134104 0.0783054 0.0788618 0.0193788 -0.0035335 -0.0007786 0.046605 -0.1087011 -0.0194679 -0.027799 -0.1200114 -0.1315812 0.1380814 0.0242555 0.0836764 0.0570653 0.0000101 0.0521159 -0.013012 0.0569138 0.0469693 -0.0190886 0.0918382 -0.0171794 0.0735667 0.047129 0.0138127 0.0143175 -0.135657 -0.0799378 0.0426529 0.0071112 0.1270985 0.0687214 -0.0132455 0.034219 -0.0261159 0.0819911 0.0627 -0.0379149 -0.0149606 -0.0972936 -0.1675902 0.0020601 -0.0217575 0.0216376 0.0686164 0.0410408 0.0362891 0.0082168 0.0259253 0.0399902 -0.1123107 0.0809472 -0.121277 -0.0461073 0.0081206 -0.07672 0.0098805 -0.1581324 -0.0699144 0.0184527 0.019246 0.0044268 0.0996566 0.0309599 0.0721624 -0.0267402 0.0536239 0.0417959 0.094935 -0.0764988 0.0971843 -0.0200038 -0.133449 -0.0739425 0.0727157 0.0106022 0.0697237 -0.0161877 0.0715142 0.0201199 0.075637 0.0504473 0.0786589 -0.0851823 0.0220067 0.0136339 0.0533392 -0.0512339 0.0920618 0.0399363 0.1043086 -0.0291815 0.0208577 -0.0176916 0.0125534 -0.0526284 -0.0072286 -0.104576 -0.0838428 unknown
polarizability: 112.6264534|-8.8080612|113.4473137|-0.4586851|0.8739143|70.1281439 unknown
InChI: InChI=1S/C9H14O/c1-5-6(2)8(4)9(10)7(5)3/h5,7H,1-4H3
charge 0 multiplicity 1
24 atoms
O  1.875792 -1.702324 -0.123986
C  -0.241692 1.290794 0.171693
C  1.170111 0.69379 -0.101771
C  -1.181396 0.076803 0.165874
C  -0.498631 -1.111866 0.039802
C  0.957467 -0.83412 -0.0702
C  -0.649738 2.405183 -0.823133
C  2.286821 1.151263 0.860457
C  -2.666093 0.258145 0.327326
C  -1.016926 -2.524716 0.027961
H  -0.256294 1.729923 1.193417
H  1.476329 0.949705 -1.137809
H  0.087515 3.228279 -0.79931
H  -0.691657 2.015196 -1.857286
H  -1.637856 2.835153 -0.577063
H  2.011401 0.946255 1.911455
H  3.22049 0.603613 0.642857
H  2.481709 2.234653 0.759514
H  -2.894734 0.828063 1.249829
H  -3.205896 -0.701833 0.371965
H  -3.086714 0.844834 -0.512394
H  -2.060307 -2.599707 0.377586
H  -0.378102 -3.163922 0.663498
H  -0.963399 -2.954364 -0.990681
