program: Gaussian 09
title: 000005471
version: EM64L-G09RevD.01
frameworkgroup: C1[X(C15H16N2O6S2)]
method: RPBEPBE
basis: SDD
operation: Freq
keyword: #p
keyword: freq=noraman
keyword: PBEPBE/SDD
title: #p freq=noraman PBEPBE/SDD
converged: YES YES NO NO
title: Mulliken charges:
elementType: S S O O O O O O N N C C C C C C C C C C C C C C C H H H H H H H H H H H H H H H H
charge: 0.225426 0.301460 -0.171348 -0.413369 -0.199173 -0.241837 -0.400624 -0.222462 -0.124106 -0.366601 -0.455687 -0.162227 -0.074878 -0.170567 0.097527 -0.688062 -0.655916 0.159049 0.222843 -0.421034 0.503949 0.199696 -0.222081 -0.781575 -0.548952 0.311028 0.292513 0.310861 0.230709 0.243245 0.240965 0.242343 0.251414 0.221856 0.348538 0.292179 0.387537 0.292857 0.289688 0.271179 0.383641
chargesum: 0.00000
title: Mulliken charges with hydrogens summed into heavy atoms:
elementType: S S O O O O O O N N C C C C C C C C C C C C C C C
charge: 0.225426 0.301460 -0.171348 -0.025832 -0.199173 -0.241837 -0.016983 -0.222462 -0.124106 -0.018063 -0.144659 -0.162227 0.217635 0.140294 0.097527 0.026856 0.059697 0.159049 0.222843 -0.128855 0.503949 0.199696 0.070775 -0.491887 -0.277773
polarizability: 2.46931231e+02 1.04367296e+01 2.28930269e+02 -1.12124971e+01 2.84165644e+00 1.89818321e+02
1716.lowfreq: -5.4639 -0.0008 0.0012 0.0014 4.9987 8.0854 14.8523 22.0566 25.6441
frequency: 12.9634 21.9447 25.6137 35.0096 41.9904 52.4179 56.5350 59.3085 64.0194 101.6285 117.6025 126.0109 146.8932 155.3357 172.6549 210.5561 225.5678 239.4053 253.2290 272.4622 285.0853 289.9274 293.0808 312.4152 323.7866 342.2377 359.1903 382.7109 398.4582 438.2811 444.2026 471.3977 516.0070 531.2211 546.1922 561.7706 568.2252 590.1809 609.9623 622.0617 637.0964 650.8508 662.4969 687.9743 698.3413 702.6165 720.9257 733.0468 763.2864 774.9515 791.3364 800.9516 806.9675 832.5396 848.9801 886.8531 905.3932 909.9940 938.8602 946.9669 948.5609 959.2508 982.0907 990.0580 1010.0934 1038.7011 1052.7955 1066.3267 1099.7106 1118.0941 1128.4399 1152.1530 1155.1086 1185.0713 1187.3953 1198.3459 1214.0757 1219.3965 1223.3924 1233.3002 1248.7871 1252.7300 1280.2391 1289.6448 1316.1155 1335.5217 1359.2967 1379.1224 1387.0984 1404.0882 1456.5731 1457.7550 1463.1841 1478.4225 1479.7234 1481.1608 1544.6732 1616.9138 1669.2651 1678.8361 1730.9298 2981.8742 2988.0508 3026.3091 3040.1360 3056.9221 3076.8030 3082.3584 3085.9866 3095.6071 3105.8047 3187.9866 3222.8314 3241.5347 3509.5924 3514.0359 3515.2939
redmass: 8.4743 10.0024 6.8673 7.0881 7.9959 7.4249 5.6686 9.5287 5.8625 8.5137 9.2402 6.8066 7.5080 6.6925 6.9688 2.5522 3.3516 1.4292 2.9893 5.4933 3.2644 1.3136 7.7201 7.5436 8.7462 4.1699 4.2982 3.7817 6.7616 5.6676 4.3121 4.3951 3.7912 3.1819 4.5169 5.0972 4.9360 3.3579 4.7453 1.5399 1.1687 3.2851 1.8990 3.7474 2.3201 1.7833 6.8613 6.5999 3.0374 3.1238 2.7678 4.9819 5.2956 4.6586 4.5480 5.1022 4.7705 1.3692 2.0019 1.8509 4.4730 3.3022 4.6661 3.9388 1.3432 2.7882 2.3300 2.5687 1.1068 2.1006 1.7787 1.6083 1.2659 1.9844 1.6895 2.2942 1.4540 1.4708 1.6799 2.1039 1.7560 1.3723 1.6454 4.1310 1.7740 2.3270 1.5137 2.7795 1.1937 1.1940 6.9607 1.0493 1.0469 1.0555 1.1057 1.7078 5.9278 8.7371 8.8425 9.0788 12.6923 1.0382 1.0357 1.0843 1.0831 1.0843 1.0964 1.0899 1.0993 1.1007 1.1003 1.0926 1.0957 1.1006 1.0639 1.0778 1.0642
irintensity: 0.2886 0.6168 2.9297 1.9097 0.7870 0.2619 1.1730 4.3874 0.3765 1.8430 0.7718 2.7759 3.5493 1.5855 0.6552 4.2919 0.4849 1.9718 1.7996 0.5460 0.6188 0.2534 1.7013 4.7512 2.1443 0.3049 2.1195 12.4555 20.4799 25.8506 2.4450 8.0104 53.4484 33.9452 13.8981 24.6264 3.0104 64.5362 22.6160 76.1001 33.4144 46.1783 152.6501 10.5219 16.2472 21.4870 6.6927 5.8716 33.7842 19.4393 46.4905 13.7951 18.1234 12.0910 8.0028 0.7205 34.3121 0.8890 3.0474 0.3995 8.8340 5.0962 23.0742 5.4567 3.6947 194.3419 391.9135 128.0346 6.4815 2.9637 51.5706 15.9955 7.3813 5.9600 16.9718 31.1433 13.6423 16.3118 12.2545 108.9338 9.5509 13.7887 13.8144 148.6605 23.4703 64.4249 20.0836 1.4901 27.5618 17.1176 11.6816 0.7379 6.2617 18.1327 15.4952 344.3442 4.1041 255.4346 179.9240 187.0219 397.3667 19.0544 18.2438 5.1203 1.7235 28.8072 13.5330 16.4913 14.1498 14.3252 18.4366 3.0285 1.5736 0.0700 34.6219 53.4740 35.1753
temp: 298.150 k
press: 1.00000 atm
elementType: 16 16 8 8 8 8 8 8 7 7 6 6 6 6 6 6 6 6 6 6 6 6 6 6 6 1 1 1 1 1 1 1 1 1 1 1 1 1 1 1 1
symmnumber: 1
zpe: 778658.5 jmol-1
zpe.correction: 0.296575 hartree
zpe.thermalcorrener: 0.321704 hartree
zpe.thermalcorrenthalpy: 0.322648 hartree
zpe.thermalcorrgfe: 0.237466 hartree
zpe.sumelectzpe: -1936.309989 hartree
zpe.sumelectthermal: -1936.284861 hartree
zpe.sumelectthermalent: -1936.283916 hartree
zpe.sumelectthermalfe: -1936.369098 hartree
dipole: 2.5452 2.5139 -2.0103
dipole: 4.1036
quadrupole: -124.1852 -168.5488 -167.5648
quadrupole: 0.8150 -8.3048 -2.5182
quadrupole: 29.2477 -15.1159 -14.1318 0.8150 -8.3048 -2.5182
hfenergy: -1936.6065646 hartree
pointgroup: C01 [X(C15H16N2O6S2)]
dipole: -0.9636928 -1.1931352 -0.504252 debye
polarizability: 245.4059052|14.6770659|222.9092987|11.3136407|-13.1966182|197.3646174 unknown
InChI: InChI=1S/C15H16N2O6S2/c1-15(2)9(14(22)23)17-11(19)8(12(17)25-15)16-10(18)7(13(20)21)6-3-4-24-5-6/h3-5,7-9,12,16,20,22H,1-2H3
charge 0 multiplicity 1
41 atoms
S  -2.476547 1.496082 -1.794824
S  3.587984 -3.246802 1.214081
O  -1.616123 0.718262 2.589034
O  -5.606626 -1.412409 0.737488
O  -3.628542 -2.592781 0.40215
O  1.918492 2.634591 -0.153256
O  5.341285 2.268991 0.28957
O  4.531852 1.269697 -1.643939
N  -2.223918 -0.055587 0.365162
N  0.962292 0.589495 0.425115
C  -1.353063 0.369667 -0.760558
C  -3.999624 0.382436 -1.297863
C  -3.672287 -0.108523 0.186979
C  -0.398493 1.055043 0.292739
C  -1.448436 0.583486 1.36559
C  -5.265453 1.256713 -1.322826
C  -4.091797 -0.786202 -2.303268
C  -4.237119 -1.50861 0.446553
C  2.040632 1.432944 0.21353
C  3.436024 0.815706 0.537838
C  3.493595 -0.702693 0.481613
C  4.45872 1.449779 -0.411696
C  3.454757 -1.476894 -0.74639
C  3.563625 -1.50197 1.616088
C  3.496639 -2.842048 -0.53505
H  -0.921754 -0.435748 -1.372429
H  -4.152843 0.5813 0.90566
H  -0.380487 2.153558 0.185852
H  -5.479899 1.60289 -2.3491
H  -6.132032 0.667992 -0.969964
H  -5.155406 2.142147 -0.673185
H  -4.198863 -0.386834 -3.325271
H  -3.195624 -1.429804 -2.277294
H  -4.976394 -1.416231 -2.087823
H  1.145482 -0.374991 0.715932
H  3.680777 1.158495 1.559266
H  -5.976227 -2.321743 0.904616
H  3.421331 -1.014821 -1.735539
H  3.617604 -1.197148 2.660666
H  3.488507 -3.650568 -1.263462
H  5.979163 2.694031 -0.346788
