program: Gaussian 09
title: 000041169
version: EM64L-G09RevD.01
frameworkgroup: C1[X(C18H19NO2)]
method: RPBEPBE
basis: SDD
operation: Freq
keyword: #p
keyword: freq=noraman
keyword: PBEPBE/SDD
title: #p freq=noraman PBEPBE/SDD
converged: YES YES NO NO
title: Mulliken charges:
elementType: O O N C C C C C C C C C C C C C C C C C C H H H H H H H H H H H H H H H H H H H
charge: -0.319385 -0.303286 -0.336030 -0.228883 0.076541 -0.663023 0.404049 0.143086 -0.509711 -0.441777 0.368592 0.131096 0.009722 -0.603022 0.220860 -0.462548 -0.365180 -0.243771 -0.264631 -0.526160 -0.527113 0.224781 0.248612 0.214496 0.208781 0.236558 0.259075 0.191092 0.216715 0.258462 0.235450 0.290196 0.224832 0.225147 0.228373 0.224936 0.254612 0.225841 0.254063 0.218554
chargesum: 0.00000
title: Mulliken charges with hydrogens summed into heavy atoms:
elementType: O O N C C C C C C C C C C C C C C C C C C
charge: -0.319385 -0.303286 -0.076955 -0.004102 0.076541 -0.199916 0.404049 0.143086 -0.064373 -0.033970 0.368592 0.131096 0.009722 -0.344560 0.220860 -0.227098 -0.074984 -0.018939 -0.039484 0.181761 0.171346
polarizability: 2.67870011e+02 -1.41965021e+01 2.48578777e+02 2.72051852e+00 9.01503147e+00 1.17824581e+02
1716.lowfreq: -8.4207 -6.4502 -0.0002 0.0003 0.0008 8.7535 51.8520 59.4520 78.4966
frequency: 51.8224 59.4257 78.4843 95.6367 102.5719 121.3876 142.6800 160.4865 164.2731 199.5460 207.5265 232.2734 259.5951 290.5525 298.1272 324.6961 332.5269 356.9770 373.6355 395.8421 412.1112 433.7595 451.6784 489.3767 511.1947 525.7609 532.1292 590.3386 608.7734 628.2602 639.4445 668.4057 683.3105 734.0031 745.2372 758.9562 779.1876 794.8076 802.2212 856.0246 880.7287 886.7987 898.6284 913.9382 939.0619 955.3578 965.5604 984.2336 991.0849 1011.9899 1043.4641 1052.3457 1074.0286 1082.0056 1111.2406 1114.7864 1115.4171 1144.0199 1151.4749 1156.0031 1159.6602 1173.1927 1176.8084 1187.9929 1206.1809 1218.1511 1223.8570 1228.0830 1267.1930 1285.2139 1299.1411 1310.1582 1322.2851 1335.1990 1361.5277 1371.4170 1381.6331 1399.4829 1412.2697 1432.5694 1439.6984 1444.4296 1446.8373 1454.1924 1457.9628 1459.3715 1462.3842 1477.0907 1477.6085 1485.9126 1487.9690 1574.0277 1576.6080 1596.2275 1612.5223 2804.2873 2865.2246 2970.9285 2972.8920 2973.9329 2978.5227 3033.2743 3033.3966 3044.4051 3070.6162 3072.4069 3115.8956 3116.9054 3118.5061 3130.8463 3143.4139 3153.3877 3192.5899 3456.8339
redmass: 3.9596 3.2859 3.4583 2.8518 3.4104 3.1526 3.1719 1.1079 1.1301 3.4302 3.1605 3.6314 3.5619 4.3319 3.8912 3.2750 5.5791 4.4969 5.7669 5.1894 5.1218 3.4334 2.9824 2.6105 4.0040 4.0761 3.1066 4.3485 3.7689 2.5026 5.9233 5.0191 4.9235 2.4820 2.7663 1.5733 4.6927 3.4031 3.6862 4.2453 1.4157 1.6082 4.7040 2.3456 3.5419 1.5027 3.2302 2.5164 1.3233 3.4454 2.4726 2.1049 3.1131 2.5999 1.2390 1.7857 1.3442 2.1054 1.3764 1.6329 1.5741 1.6546 1.2486 1.3979 1.3249 2.0788 2.6561 1.3342 1.3460 2.4025 1.5279 1.7457 1.7060 2.0304 5.7814 2.9005 1.8684 2.6911 1.6846 1.7002 1.3721 1.1451 1.7434 1.1408 1.0532 1.1428 1.7558 1.0683 1.0917 1.0577 2.6726 8.6701 6.4183 7.4070 6.5240 1.0786 1.0715 1.0314 1.0312 1.0586 1.0599 1.1005 1.1001 1.0911 1.1026 1.1046 1.0865 1.1029 1.1032 1.0903 1.0919 1.0984 1.0940 1.0751
irintensity: 0.3891 2.3651 2.1586 5.7556 0.6208 4.0789 2.0606 0.1913 0.4079 1.9924 1.1959 4.2554 7.6879 6.3952 5.7096 1.5753 5.8469 0.1454 0.8952 5.2134 0.6170 1.2919 3.2883 33.3219 5.7301 4.6005 11.6269 1.0442 35.0588 34.7701 11.9381 7.5584 4.5953 7.8444 19.6948 62.8168 8.8553 16.3128 2.5186 5.9333 1.4410 16.1187 9.2347 3.4179 40.9758 2.0239 54.3613 37.5591 0.8613 22.8470 8.7481 2.3410 39.1631 5.2142 6.8648 10.8729 14.0321 4.6026 1.2562 4.9400 8.4932 5.0882 4.0279 13.5606 12.1760 17.1247 26.0819 1.2606 0.9091 84.3793 16.0383 28.4343 1.3035 10.3440 7.0399 18.3515 4.6961 19.6902 17.8553 52.5755 12.1480 10.4206 6.4052 11.2868 12.8788 5.8453 14.8871 4.2853 4.5123 26.4141 27.0894 9.7272 5.2845 19.9248 1.3671 57.9873 121.2400 97.1879 58.4502 24.8474 32.5565 29.3485 36.6586 58.4348 26.3937 23.8777 6.1756 20.4059 26.6171 20.9353 5.9680 42.6468 7.0910 1.1681
temp: 298.150 k
press: 1.00000 atm
elementType: 8 8 7 6 6 6 6 6 6 6 6 6 6 6 6 6 6 6 6 6 6 1 1 1 1 1 1 1 1 1 1 1 1 1 1 1 1 1 1 1
symmnumber: 1
zpe: 860224.7 jmol-1
zpe.correction: 0.327642 hartree
zpe.thermalcorrener: 0.345865 hartree
zpe.thermalcorrenthalpy: 0.346809 hartree
zpe.thermalcorrgfe: 0.282325 hartree
zpe.sumelectzpe: -900.974379 hartree
zpe.sumelectthermal: -900.956156 hartree
zpe.sumelectthermalent: -900.955212 hartree
zpe.sumelectthermalfe: -901.019696 hartree
dipole: 0.2889 0.6479 -0.7172
dipole: 1.0088
quadrupole: -113.8461 -107.1996 -125.0504
quadrupole: 5.7428 3.5154 -3.3767
quadrupole: 1.5193 8.1657 -9.6850 5.7428 3.5154 -3.3767
hfenergy: -901.3020212 hartree
pointgroup: C01 [X(C18H19N1O2)]
dipole: -0.0231784 0.2772702 0.2830074 debye
polarizability: 274.3371271|5.5530398|242.0690701|-3.2095095|-9.3693606|117.8671715 unknown
InChI: InChI=1S/C18H19NO2/c1-20-15-10-12-7-8-19-14-9-11-5-3-4-6-13(11)17(16(12)14)18(15)21-2/h3-6,10,14,19H,7-9H2,1-2H3
charge 0 multiplicity 1
40 atoms
O  0.542495 -2.603127 -0.09693
O  3.3089 -1.956807 -0.259782
N  -0.015425 3.574421 -0.214948
C  -0.583266 2.274873 0.194293
C  0.454356 1.15646 0.070526
C  -1.808033 1.92138 -0.671037
C  1.833768 1.457142 -0.04934
C  -0.016889 -0.198567 0.079481
C  2.328006 2.898353 -0.095688
C  1.271256 3.8798 0.442828
C  -2.386426 0.598001 -0.202453
C  -1.48694 -0.446846 0.185233
C  0.945319 -1.24331 -0.04843
C  2.767008 0.397064 -0.129949
C  2.334105 -0.938652 -0.121296
C  -3.781556 0.396437 -0.12148
C  -2.036905 -1.664025 0.67617
C  -4.314528 -0.825558 0.346808
C  -3.433269 -1.852015 0.754866
C  0.720312 -3.232663 -1.427364
C  3.411959 -2.884561 0.889715
H  -0.922347 2.29263 1.265805
H  -1.475542 1.868703 -1.72733
H  -2.570764 2.72081 -0.604841
H  3.269828 2.99551 0.478156
H  2.553924 3.168844 -1.145698
H  -0.70529 4.331069 -0.127095
H  1.215592 3.790815 1.556922
H  1.558996 4.919572 0.204508
H  3.841992 0.595224 -0.20166
H  -4.455309 1.208253 -0.421967
H  -1.362109 -2.462204 0.989228
H  -5.399482 -0.968396 0.405843
H  -3.830867 -2.798309 1.138836
H  0.084236 -2.724305 -2.175738
H  0.394664 -4.277344 -1.305518
H  1.781006 -3.191079 -1.733901
H  4.189424 -3.611839 0.609174
H  2.449264 -3.394583 1.070364
H  3.724041 -2.332271 1.796887
