program: Gaussian 09
title: 000005745
version: EM64L-G09RevD.01
frameworkgroup: C1[X(C23H30O6)]
method: RPBEPBE
basis: SDD
operation: Freq
keyword: #pfreq=noraman
keyword: PBEPBE/SDD
title: #p freq=noraman PBEPBE/SDD
converged: NO YES NO NO
title: Mulliken charges:
elementType: O O O O O O C C C C C C C C C C C C C C C C C C C C C C C H H H H H H H H H H H H H H H H H H H H H H H H H H H H H H
charge: -0.463443 -0.190866 -0.178030 -0.233337 -0.236633 -0.253711 -0.106032 0.291521 -0.169356 -0.264827 0.122853 0.207168 -0.547817 -0.656051 -0.549354 -0.470899 0.143170 -0.814622 0.543041 -0.642345 -0.486428 0.114437 -0.803466 -0.564595 -0.586546 0.178932 -0.414221 0.325924 -0.755988 0.257930 0.252832 0.231311 0.224383 0.245300 0.268892 0.273859 0.280635 0.211177 0.228178 0.217769 0.231554 0.233837 0.284792 0.225758 0.236502 0.202045 0.267439 0.226433 0.207111 0.276499 0.342644 0.246791 0.233572 0.253893 0.286323 0.257492 0.249614 0.260098 0.246856
chargesum: 0.00000
title: Mulliken charges with hydrogens summed into heavy atoms:
elementType: O O O O O O C C C C C C C C C C C C C C C C C C C C C C C
charge: -0.120799 -0.190866 -0.178030 -0.233337 -0.236633 -0.253711 0.151898 0.291521 0.083476 -0.033516 0.122853 0.207168 -0.078135 -0.113300 -0.057542 -0.024952 0.143170 -0.064439 0.543041 -0.180086 -0.016944 0.114437 -0.093422 -0.084231 -0.332652 0.178932 0.129594 0.325924 0.000581
polarizability: 3.37053812e+02 8.79735124e+00 2.43772174e+02 -1.41575347e+01 -4.62773983e-01 1.99209238e+02
1716.lowfreq: -4.3453 0.0006 0.0007 0.0009 9.1383 10.3313 26.4394 27.4994 42.7422
frequency: 26.3719 27.3985 42.7097 52.4459 62.6914 66.2007 77.8498 86.2201 97.1705 108.2581 122.9922 148.6648 154.3728 174.1457 186.3647 201.0936 205.6036 214.9351 225.0295 236.2724 244.5200 261.7012 268.8318 271.3848 280.6001 283.3341 294.1324 318.0616 331.0324 347.6125 361.7469 376.0356 380.8895 404.1911 406.7683 425.8074 435.9087 446.1850 458.5641 491.2186 496.5781 520.0649 530.3290 543.0797 565.5060 570.4985 601.4754 614.4278 624.0590 637.7739 649.2171 677.3682 723.2961 740.9762 766.4144 777.9382 783.0307 789.9326 803.1147 824.0150 842.1633 866.2327 882.1937 895.8818 904.6022 912.7383 918.1009 938.4559 941.6244 950.2024 966.8871 971.6748 984.6512 999.7070 1005.9572 1013.6512 1021.2969 1025.2891 1042.2258 1043.8455 1044.2637 1054.7833 1070.2570 1092.7871 1103.1965 1112.9813 1114.0961 1119.6269 1127.7873 1147.5970 1159.9814 1170.7434 1178.8048 1179.3148 1191.6658 1202.4593 1209.9329 1212.1746 1216.3236 1226.6406 1233.0284 1242.1588 1256.9764 1264.8169 1276.2585 1279.9675 1283.2422 1288.9715 1294.0238 1307.2402 1308.1139 1323.3945 1327.8530 1330.1648 1333.1814 1343.3447 1348.0541 1352.2303 1372.8482 1383.5003 1384.9997 1409.4796 1414.9723 1444.0868 1452.6411 1452.9191 1453.8596 1457.6225 1464.4661 1468.0253 1475.3236 1478.6020 1479.3788 1483.2006 1493.8912 1498.3617 1584.9199 1615.7467 1625.6060 1627.1922 1650.6645 2907.3045 2951.5913 2955.4862 2966.2261 2972.1443 2982.2252 2982.8985 2986.8359 2989.9725 2990.2977 2995.5105 3004.1352 3008.3069 3036.0603 3036.8024 3043.7576 3059.5811 3061.8651 3071.2025 3072.5768 3076.8474 3083.5266 3084.4022 3099.7499 3101.7903 3104.4364 3111.0790 3116.1702 3142.4081 3564.3611
redmass: 5.2535 6.9209 5.0483 1.4999 2.6972 3.3659 3.5613 5.5735 3.7217 6.2798 5.0439 5.8107 2.5763 1.5552 3.3020 3.1373 2.7675 3.3952 2.4980 1.4121 2.2920 1.6455 1.9899 2.8264 2.9478 2.6676 4.0148 5.6284 3.0442 4.1011 2.7715 2.7180 3.3428 3.7310 3.4112 3.4246 3.2754 3.4690 2.6935 4.1205 3.8350 3.2043 2.7687 3.5242 3.1997 3.1695 3.5809 4.1590 3.6985 3.4561 3.6571 3.5850 3.9211 3.4476 4.0726 2.1952 2.8910 2.8153 2.3395 2.2536 2.7447 2.4779 1.5455 2.9195 2.2618 2.2384 2.1538 2.1544 2.1512 1.8223 2.5284 2.0614 2.5276 2.2349 2.2118 3.3748 2.0745 1.8395 1.9409 1.6549 2.1950 2.6442 3.0931 1.9078 2.0451 1.8781 2.4745 1.7505 1.7846 2.9184 1.8126 2.0312 1.6536 1.7284 2.1169 2.3368 2.0209 1.3353 1.9215 1.3477 1.6464 1.7142 1.6560 1.4762 1.7788 1.6240 1.4453 1.5258 1.4253 1.4520 1.5068 1.4119 1.4748 1.4473 1.4560 2.0065 1.4499 1.3908 1.4591 1.2286 1.2378 1.0991 1.1785 1.0776 1.0742 1.0645 1.0561 1.0881 1.0679 1.0882 1.0627 1.0674 1.0742 1.0845 1.0596 1.0579 9.9464 9.2738 7.9186 9.5932 9.6182 1.0793 1.0804 1.0666 1.0629 1.0695 1.0695 1.0693 1.0599 1.0414 1.0639 1.0392 1.0642 1.0380 1.0982 1.0586 1.0963 1.0978 1.0950 1.1015 1.0985 1.1003 1.0932 1.0981 1.0996 1.0945 1.1031 1.0986 1.0911 1.1024 1.0663
irintensity: 0.5150 0.6876 2.3042 1.6508 1.6501 1.7925 1.9018 2.6937 3.1271 2.0607 3.1507 2.4932 0.3157 0.3768 1.8561 0.6224 3.2431 13.0015 0.4418 0.5561 5.9303 34.5916 65.2987 8.4756 6.9612 3.1132 2.6978 9.9401 0.4649 0.8125 2.1546 2.6732 6.6755 8.4940 1.9662 8.0372 2.5776 8.2333 0.4905 7.7539 3.2702 3.6194 0.4432 6.1934 3.0940 0.4886 4.6481 5.1340 4.4526 2.4606 1.1308 15.0862 7.4848 9.6378 15.5941 7.8314 9.2953 13.8190 1.1144 1.4524 1.4511 20.8666 27.1829 37.7593 17.9963 10.1797 19.1321 5.8141 5.6058 19.6769 15.7227 7.7280 1.1457 1.1806 15.0549 69.1148 4.7854 7.6762 7.4030 10.1079 6.0972 21.5229 16.1279 6.5814 37.0230 3.0924 6.3692 14.8976 5.8664 4.8537 35.7183 14.8323 28.2582 26.0937 36.8868 149.8640 30.0894 7.6525 23.3744 48.6835 22.4094 19.3818 36.8812 41.4923 17.3960 34.1111 15.3948 1.4548 0.1085 18.0626 1.3155 4.5185 5.4786 14.9913 21.7157 5.3570 3.0553 2.4512 0.5264 27.4159 57.7279 48.1179 14.4840 23.5367 13.7944 18.7851 16.9836 18.3163 9.9780 6.2866 1.0278 20.1732 6.9309 7.4350 5.6939 5.0021 174.9271 124.8312 273.1567 41.4395 139.5711 9.8461 6.1038 13.0354 22.6681 16.1707 7.3085 31.2423 6.1205 25.1426 43.8112 21.8444 29.9410 1.0213 48.2450 8.5594 31.4425 14.0430 24.0208 4.2307 36.5715 23.7802 10.0694 18.4355 9.5048 8.1418 2.8402 5.6668 11.7487 6.2779 8.2657
temp: 298.150 k
press: 1.00000 atm
elementType: 8 8 8 8 8 8 6 6 6 6 6 6 6 6 6 6 6 6 6 6 6 6 6 6 6 6 6 6 6 1 1 1 1 1 1 1 1 1 1 1 1 1 1 1 1 1 1 1 1 1 1 1 1 1 1 1 1 1 1
symmnumber: 1
zpe: 1280196.2 jmol-1
zpe.correction: 0.487601 hartree
zpe.thermalcorrener: 0.515981 hartree
zpe.thermalcorrenthalpy: 0.516926 hartree
zpe.thermalcorrgfe: 0.429588 hartree
zpe.sumelectzpe: -1343.582510 hartree
zpe.sumelectthermal: -1343.554129 hartree
zpe.sumelectthermalent: -1343.553185 hartree
zpe.sumelectthermalfe: -1343.640523 hartree
dipole: 5.7824 4.8906 0.4625
dipole: 7.5873
quadrupole: -214.5621 -165.8361 -168.6561
quadrupole: -12.3242 20.5597 3.8809
quadrupole: -31.5440 17.1820 14.3620 -12.3242 20.5597 3.8809
hfenergy: -1344.0701105 hartree
pointgroup: C01[X(C23H30O6)]
dipole: -2.2078679 1.9272355 -0.5672284 debye
polarizability: 336.8823901|-13.6130219|243.2972613|-9.2710971|-7.1576894|199.8555728 unknown
InChI: InChI=1S/C23H30O6/c1-13(24)29-12-19(27)23(28)9-7-17-16-5-4-14-10-15(25)6-8-21(14,2)20(16)18(26)11-22(17,23)3/h10,16-17,20,28H,4-9,11-12H2,1-3H3
charge 0 multiplicity 1
59 atoms
O  -2.174765 1.058619 -2.294711
O  0.586524 -2.247022 0.704065
O  -4.533512 1.337207 0.407713
O  -5.542864 -0.952884 -0.791566
O  7.047934 -1.3487 -0.774538
O  -4.138581 -1.801561 0.858695
C  -0.115203 1.663497 -0.356831
C  -1.275523 0.667158 -0.038404
C  1.204822 1.308957 0.353267
C  1.6432 -0.141408 -0.066851
C  -2.437192 1.363315 -0.862157
C  3.018911 -0.612672 0.545938
C  -0.744261 3.058053 -0.118746
C  -0.868089 -0.746469 -0.524477
C  -2.238909 2.878088 -0.548829
C  2.320842 2.31394 -0.008843
C  0.474487 -1.145531 0.102581
C  -1.643634 0.604779 1.466824
C  4.069081 0.48855 0.298987
C  3.672369 1.915883 0.626619
C  3.459337 -1.929506 -0.172061
C  -3.843485 0.846798 -0.519198
C  2.914095 -0.841179 2.089709
C  4.94062 -2.294172 0.053485
C  5.339559 0.212867 -0.139577
C  5.870139 -1.151457 -0.342591
C  -4.35894 -0.313957 -1.389613
C  -5.293342 -1.660548 0.395865
C  -6.577403 -2.180356 0.990701
H  0.069857 1.569977 -1.449194
H  1.055971 1.339643 1.452012
H  1.794396 -0.079958 -1.171725
H  -0.238298 3.846196 -0.702318
H  -0.678032 3.344833 0.947192
H  -0.764235 -0.728594 -1.627577
H  -1.609523 -1.512865 -0.238385
H  -2.936767 3.171721 0.253512
H  -2.494262 3.492671 -1.434375
H  2.038032 3.328249 0.331823
H  2.427818 2.357468 -1.112554
H  -0.779871 0.262279 2.063565
H  -1.971998 1.579028 1.866598
H  -2.457656 -0.121127 1.632174
H  3.580875 2.016686 1.72935
H  4.470744 2.611982 0.311885
H  3.294515 -1.806784 -1.262814
H  2.810905 -2.754823 0.163464
H  3.902303 -1.102123 2.508441
H  2.561994 0.062509 2.618998
H  2.212179 -1.663399 2.299928
H  -2.492335 1.819438 -2.843405
H  5.224135 -3.197712 -0.514671
H  5.125396 -2.525348 1.122775
H  6.053562 1.028363 -0.316738
H  -3.553449 -1.048142 -1.560971
H  -4.70667 0.059649 -2.366394
H  -7.290495 -2.465905 0.201704
H  -7.042387 -1.377853 1.592024
H  -6.36542 -3.035048 1.649919
