program: Gaussian 09
title: 000041076
version: EM64L-G09RevD.01
frameworkgroup: C1[X(C11H22O)]
method: RPBEPBE
basis: SDD
operation: Freq
keyword: #pfreq=noraman
keyword: PBEPBE/SDD
title: #p freq=noraman PBEPBE/SDD
converged: YES YES NO NO
title: Mulliken charges:
elementType: O C C C C C C C C C C C H H H H H H H H H H H H H H H H H H H H H H
charge: -0.452806 0.034485 -0.464121 -0.463046 -0.433829 -0.450877 -0.440809 -0.030981 -0.382533 -0.354280 -0.357412 -0.696899 0.191696 0.191111 0.214795 0.201492 0.195321 0.207641 0.216349 0.182975 0.213345 0.194616 0.189868 0.177119 0.202131 0.187503 0.186570 0.188640 0.327126 0.195064 0.194936 0.209596 0.215379 0.209836
chargesum: 0.00000
title: Mulliken charges with hydrogens summed into heavy atoms:
elementType: O C C C C C C C C C C C
charge: -0.125680 0.226181 -0.058214 -0.066234 -0.009839 -0.054557 -0.056325 0.146137 0.007102 0.020930 0.032588 -0.062088
polarizability: 1.52876831e+02 -1.52896574e+00 1.10471970e+02 1.17314914e+00 7.69992587e-01 9.87990829e+01
1716.lowfreq: -8.6270 -0.0010 -0.0006 -0.0003 10.6038 27.6034 38.0051 50.0896 63.1715
frequency: 37.6219 49.4156 63.0576 94.4097 119.8117 138.1687 184.6182 209.8270 228.7190 232.8769 247.2615 298.8010 319.4737 348.8663 395.7479 422.5865 459.6860 469.0100 487.5630 590.5507 723.3219 743.6231 773.5390 786.9577 817.8620 864.7759 891.5205 901.1180 935.8398 942.4293 960.9043 992.2907 1014.5325 1035.6458 1038.8511 1053.4685 1058.2064 1075.4747 1093.0957 1098.1109 1103.5009 1130.5109 1160.6314 1187.7915 1199.4635 1231.3619 1238.7390 1245.1991 1253.5966 1268.9151 1280.2982 1287.4081 1289.6989 1301.4103 1311.3531 1313.5511 1319.8227 1337.2334 1346.8787 1350.9487 1356.5586 1362.5303 1389.7382 1397.7297 1455.9651 1460.9662 1463.5154 1464.6706 1469.1124 1472.0359 1476.6750 1477.0182 1480.7766 1488.3213 2915.8163 2933.6668 2944.1372 2951.0574 2953.4499 2958.2433 2960.6443 2966.6007 2967.7352 2971.4440 2987.3575 2988.7468 2994.7663 3015.2622 3019.2178 3031.2447 3036.6363 3038.1984 3055.6965 3067.7511 3070.1955 3551.3165
redmass: 3.5668 1.6866 3.4931 3.0991 1.7624 2.7183 3.2411 1.8874 1.1335 3.3614 2.3270 1.2840 2.3680 2.7712 2.8749 1.9160 2.8552 2.6337 3.1579 2.5392 1.0801 1.2200 2.2057 1.4936 1.4219 1.6742 1.8327 1.4339 2.0425 1.5756 1.6961 3.7870 3.8350 2.0817 1.4259 1.3050 2.0701 2.1615 1.8825 1.9683 2.1640 2.0047 2.1465 1.4019 1.5657 1.3578 1.2925 1.2470 1.2944 1.2835 1.1992 1.1096 1.1719 1.2983 1.2370 1.2735 1.3291 1.4583 1.5710 1.5616 1.5751 1.5410 1.2179 1.6756 1.0830 1.0881 1.0823 1.0772 1.0793 1.0792 1.0462 1.0952 1.0764 1.0881 1.0836 1.0803 1.0596 1.0593 1.0625 1.0618 1.0636 1.0623 1.0599 1.0366 1.0895 1.0673 1.1003 1.1018 1.0992 1.1014 1.0972 1.1019 1.1022 1.1006 1.0993 1.0659
irintensity: 0.0870 0.2119 0.3819 0.2785 0.0094 1.1873 0.2213 1.1713 0.0082 0.0750 2.7104 101.4573 49.2113 3.7392 1.7219 0.0559 1.0685 8.3218 0.9044 6.5473 10.5938 0.8891 0.9283 0.5226 0.7911 4.6871 9.1146 10.2607 12.5536 1.6084 1.1765 51.0548 25.3412 17.1787 18.6614 0.2937 1.0170 1.9550 17.4344 6.7593 2.4879 10.5484 0.5345 10.6533 0.7814 3.2587 9.6118 4.4314 3.6374 4.6448 0.4937 1.1375 0.7361 0.2206 0.1809 0.9879 4.8537 1.1016 5.2556 0.9498 0.1793 13.7920 11.4967 1.8431 0.5076 7.3416 2.0380 3.5507 6.0758 11.7122 10.3151 4.4397 4.1729 19.3775 50.0843 2.6230 6.6660 2.8818 13.2649 13.9524 80.5820 28.7764 142.1342 37.6692 15.2831 16.0440 4.7537 6.7906 41.0297 7.2329 105.5251 103.0266 63.4520 95.7320 54.5024 2.3178
temp: 298.150 k
press: 1.00000 atm
elementType: 8 6 6 6 6 6 6 6 6 6 6 6 1 1 1 1 1 1 1 1 1 1 1 1 1 1 1 1 1 1 1 1 1 1
symmnumber: 1
zpe: 813178.0 jmol-1
zpe.correction: 0.309723 hartree
zpe.thermalcorrener: 0.323889 hartree
zpe.thermalcorrenthalpy: 0.324833 hartree
zpe.thermalcorrgfe: 0.268331 hartree
zpe.sumelectzpe: -506.589798 hartree
zpe.sumelectthermal: -506.575632 hartree
zpe.sumelectthermalent: -506.574688 hartree
zpe.sumelectthermalfe: -506.631190 hartree
dipole: 0.7660 1.6575 0.6609
dipole: 1.9419
quadrupole: -81.5743 -78.4836 -76.5242
quadrupole: -9.5315 -3.9345 -0.9332
quadrupole: -2.7136 0.3771 2.3364 -9.5315 -3.9345 -0.9332
hfenergy: -506.899521 hartree
pointgroup: C01 [X(C11H22O1)]
dipole: 0.3012382 -0.6466358 -0.2735009 debye
polarizability: 152.8754103|1.5551729|110.4355838|-1.171522|1.0079991|98.8368901 unknown
InChI: InChI=1S/C11H22O/c1-2-3-4-5-10-6-8-11(12)9-7-10/h10-12H,2-9H2,1H3
charge 0 multiplicity 1
34 atoms
O  -4.773139 0.672992 0.203219
C  -0.56001 -0.38158 0.212481
C  -1.02229 0.980658 -0.370545
C  -1.589564 -1.484706 -0.148922
C  -2.460012 1.349464 0.067191
C  -3.022608 -1.112301 0.301998
C  0.862454 -0.777246 -0.259198
C  -3.454031 0.239938 -0.301505
C  1.988735 0.168231 0.219146
C  3.400819 -0.326959 -0.166888
C  4.529033 0.620318 0.301922
C  5.937965 0.118784 -0.08183
H  -0.540104 -0.286527 1.321597
H  -0.97074 0.927204 -1.479412
H  -0.331025 1.786625 -0.060676
H  -1.290013 -2.446646 0.311487
H  -1.575437 -1.641741 -1.248878
H  -2.499714 1.494479 1.165019
H  -2.782063 2.29931 -0.398348
H  -3.736172 -1.909199 0.005483
H  -3.063841 -1.028437 1.40658
H  0.874224 -0.830619 -1.369044
H  1.084909 -1.803459 0.102993
H  -3.492583 0.137849 -1.4115
H  1.83726 1.182084 -0.203165
H  1.928953 0.277583 1.32281
H  3.568081 -1.336262 0.264798
H  3.459744 -0.447974 -1.26915
H  -5.433962 -0.042883 0.020041
H  4.362241 1.627191 -0.132827
H  4.465882 0.743841 1.402588
H  6.140611 -0.873059 0.36495
H  6.724969 0.813165 0.265924
H  6.037325 0.017686 -1.17924
