program: Gaussian 09
title: 000005573
version: EM64L-G09RevD.01
frameworkgroup: C1[X(C22H29NO5)]
method: RPBEPBE
basis: SDD
operation: Freq
keyword: #p
keyword: freq=noraman
keyword: PBEPBE/SDD
title: #p freq=noraman PBEPBE/SDD
converged: YES YES NO NO
title: Mulliken charges:
elementType: O O O O O N C C C C C C C C C C C C C C C C C C C C C C H H H H H H H H H H H H H H H H H H H H H H H H H H H H H
charge: -0.300111 -0.251441 -0.289115 -0.287643 -0.294282 -0.148201 0.265894 -0.442199 -0.443950 0.454824 -0.742828 -0.636847 -0.666431 -0.371113 -0.376504 -0.267554 -0.276329 -0.246848 0.190067 0.279008 -0.489880 -0.533848 0.261482 0.308530 0.059510 -0.523389 -0.535329 -0.514948 0.244863 0.197782 0.227224 0.281681 0.233132 0.210007 0.242892 0.217732 0.218125 0.225982 0.223092 0.219876 0.238889 0.233200 0.224578 0.226793 0.224499 0.229209 0.285140 0.293112 0.214113 0.228935 0.262619 0.229658 0.232275 0.241831 0.261971 0.221115 0.229150
chargesum: 0.00000
title: Mulliken charges with hydrogens summed into heavy atoms:
elementType: O O O O O N C C C C C C C C C C C C C C C C C C C C C C
charge: -0.300111 -0.251441 -0.289115 -0.287643 -0.294282 -0.148201 0.265894 0.000445 0.064955 0.454824 -0.056797 0.024993 0.015426 -0.137913 -0.151926 -0.040761 -0.051830 -0.017639 0.190067 0.279008 -0.204740 -0.240736 0.261482 0.308530 0.059510 0.182278 0.168435 0.197288
polarizability: 3.29251254e+02 -4.01211099e+00 2.86827598e+02 1.46870499e+01 9.74853374e+00 2.04835603e+02
1716.lowfreq: -4.1440 -0.7594 -0.0008 -0.0006 -0.0003 6.9111 11.3491 19.0265 26.1363
frequency: 5.3723 18.7235 25.9403 33.6022 42.1139 54.4722 57.0869 74.8350 76.4856 85.3968 97.8223 109.5780 123.4933 134.9496 149.8129 159.8332 163.9792 167.6445 183.9291 193.6542 198.8226 206.8840 214.0082 229.3435 230.3660 243.5557 259.6881 275.9353 291.8750 302.5338 319.5762 333.6561 347.3865 365.1853 370.2979 376.7077 393.6429 405.1727 422.0997 446.9236 473.2615 495.9462 505.6877 534.0889 556.8317 567.4877 596.6356 600.7933 618.0454 623.4036 671.5843 703.0464 704.3822 731.5892 749.1161 765.4311 765.6956 770.8173 834.4111 849.6798 856.4719 869.5771 880.8058 894.4929 915.3013 920.2650 944.9371 953.0506 973.3769 976.4444 989.1931 990.6887 992.6130 1007.7889 1012.8455 1035.4639 1038.4941 1063.7520 1078.7462 1083.2268 1084.5912 1091.8329 1108.4663 1111.0372 1111.8883 1120.6009 1139.6927 1142.1885 1145.8071 1153.7932 1159.7496 1165.4287 1174.5413 1183.8111 1200.5714 1205.2409 1228.5274 1230.3427 1236.4894 1244.8100 1292.3665 1306.5171 1325.2335 1342.2115 1360.8744 1375.7848 1378.8903 1395.1021 1402.4401 1419.1311 1419.3495 1433.9252 1437.1563 1443.5543 1445.3175 1453.8281 1457.4399 1459.8565 1466.0852 1467.2320 1470.2863 1474.7683 1476.4606 1479.2493 1481.5606 1483.9379 1484.8991 1487.3345 1491.9385 1496.1763 1509.0510 1574.3977 1585.8804 1599.1359 1608.5607 1618.4473 2887.0293 2904.5560 2967.2625 2974.7040 2985.0101 2987.2717 3016.7173 3026.7589 3034.6570 3041.2283 3058.4658 3059.9122 3076.9378 3082.2995 3089.7665 3093.1865 3093.4214 3094.8378 3103.6030 3120.4587 3127.2798 3127.6814 3129.2394 3130.6994 3145.6062 3153.3406 3165.2116 3176.9427 3192.0776
redmass: 4.3785 5.0566 3.0241 4.3450 4.8516 2.8546 3.3699 3.4647 2.5745 3.3093 2.7977 3.1182 3.7251 1.8727 1.7943 1.6531 3.3427 1.9374 3.0595 2.3106 1.6063 1.2711 2.9819 1.2985 2.2665 3.6668 3.8760 2.0957 5.0526 3.9536 2.8527 3.9500 3.8940 4.0495 3.2753 2.9811 2.7668 2.8125 4.1007 3.6098 3.7642 4.6214 4.2406 6.3413 3.0884 5.1093 3.7074 4.8344 6.3157 5.0972 4.9946 1.7676 3.7642 5.3005 2.1358 4.1476 1.8975 4.7359 2.0647 1.2627 3.2849 3.7377 1.4895 3.9569 1.5732 1.6547 6.5414 7.9927 1.4048 2.1318 6.1198 5.7653 1.3126 2.3098 2.2840 1.5849 2.1579 5.6825 1.8246 2.4558 1.4755 1.9388 1.2361 1.2366 1.2582 1.9491 2.0271 1.7786 1.8356 1.4353 1.4540 2.6192 1.0557 2.0217 2.0180 1.1963 1.6192 2.5548 1.7246 1.9210 1.4240 3.8523 1.4016 1.4732 1.5237 5.0838 5.4731 1.2064 2.5230 1.2987 1.1540 2.2272 1.3062 1.3750 1.1391 1.1839 1.0794 1.0749 1.0530 1.6197 1.0766 1.0556 1.0885 1.3284 1.0715 1.4759 1.0628 1.1702 1.0590 1.0926 1.0715 8.4953 5.6819 6.5604 5.9398 11.7444 1.0545 1.0534 1.0323 1.0341 1.0319 1.0362 1.0609 1.0775 1.0753 1.0631 1.1044 1.0991 1.0990 1.0983 1.0983 1.0992 1.1008 1.0977 1.1029 1.0844 1.1004 1.1044 1.0879 1.1048 1.0920 1.0944 1.1001 1.0923 1.0909
irintensity: 0.4480 0.0972 0.3167 1.2052 0.3664 0.2883 1.4628 2.8468 8.7801 2.4004 3.0923 0.9281 1.0133 1.3440 1.3360 1.6514 2.6373 2.8961 2.0588 2.0764 2.8195 1.4760 1.4133 0.6506 1.6037 2.9249 2.8756 0.8631 15.0274 5.1572 3.9555 0.5175 2.4499 19.5602 11.3850 1.2089 1.2088 0.4454 5.6786 3.3056 12.4263 2.6089 0.6228 8.6557 5.8366 0.9069 28.7192 2.2917 0.6415 6.5879 8.6207 67.0984 1.4166 22.1879 3.9732 14.2835 42.9159 13.2409 3.4710 0.0753 13.7040 7.5678 6.9525 21.1089 22.4550 2.3678 1.4730 92.5676 0.7893 36.9354 162.5589 38.2814 0.3155 6.0890 27.2680 9.1904 7.4642 367.6021 4.6646 23.0005 1.9990 4.5069 24.8412 3.3902 0.1251 18.0039 17.6092 3.4187 102.5600 65.6128 29.5357 237.0867 0.4793 2.2580 9.2446 0.1463 128.3023 1.7059 12.0765 4.8645 49.9313 338.9442 26.9342 15.9317 50.6499 3.8877 23.0143 21.3702 64.6689 12.4343 4.2090 8.9450 42.5041 22.7365 6.6306 43.4554 8.0800 3.1570 14.4824 86.6631 2.2891 21.3276 22.1152 19.6328 11.3134 15.0778 24.7045 9.2383 16.9921 16.4570 4.2854 163.1454 1.6474 9.1621 7.3935 170.1649 63.4565 100.2877 50.1189 89.8759 78.8162 37.6529 19.6917 47.1640 25.1876 38.1302 34.6440 9.2214 35.6181 32.9639 18.1606 78.9052 29.1223 20.6527 13.9864 1.9363 22.3848 16.7520 3.1372 17.7774 30.0314 45.7930 11.4204 1.7737 3.0494
temp: 298.150 k
press: 1.00000 atm
elementType: 8 8 8 8 8 7 6 6 6 6 6 6 6 6 6 6 6 6 6 6 6 6 6 6 6 6 6 6 1 1 1 1 1 1 1 1 1 1 1 1 1 1 1 1 1 1 1 1 1 1 1 1 1 1 1 1 1
symmnumber: 1
zpe: 1229030.2 jmol-1
zpe.correction: 0.468113 hartree
zpe.thermalcorrener: 0.498396 hartree
zpe.thermalcorrenthalpy: 0.499340 hartree
zpe.thermalcorrgfe: 0.403687 hartree
zpe.sumelectzpe: -1284.416490 hartree
zpe.sumelectthermal: -1284.386207 hartree
zpe.sumelectthermalent: -1284.385263 hartree
zpe.sumelectthermalfe: -1284.480915 hartree
dipole: 1.6019 4.5485 2.0223
dipole: 5.2292
quadrupole: -149.9430 -162.9083 -164.9102
quadrupole: -4.6762 -0.8945 -4.1080
quadrupole: 9.3108 -3.6545 -5.6564 -4.6762 -0.8945 -4.1080
hfenergy: -1284.8846025 hartree
pointgroup: C01 [X(C22H29N1O5)]
dipole: 0.6347411 1.7668466 0.8413783 debye
polarizability: 329.6434237|-4.1341268|286.1274155|12.883586|12.3292494|205.1436157 unknown
InChI: InChI=1S/C22H29NO5/c1-7-22(23(2)3,17-11-9-8-10-12-17)15-28-21(24)16-13-18(25-4)20(27-6)19(14-16)26-5/h8-14H,7,15H2,1-6H3
charge 0 multiplicity 1
57 atoms
O  0.713348 -1.092227 -0.131017
O  -0.275899 -2.869262 -1.270739
O  -5.275776 -1.746149 -0.876041
O  -3.030202 2.041783 1.2350
O  -5.403139 0.76271 0.442628
N  4.437532 -1.488074 0.01293
C  3.109171 -0.80308 0.278484
C  2.784569 -0.823153 1.809817
C  2.042577 -1.679008 -0.427643
C  3.11389 0.659703 -0.254495
C  2.763021 -2.221107 2.465195
C  4.848573 -1.559076 -1.411737
C  5.579598 -1.045032 0.842789
C  2.582264 0.996307 -1.528964
C  3.742174 1.70243 0.482938
C  2.666479 2.30927 -2.042723
C  3.832191 3.017034 -0.026183
C  3.293697 3.330566 -1.2944
C  -0.393049 -1.790894 -0.636333
C  -1.671468 -1.096625 -0.325657
C  -1.686098 0.167546 0.31756
C  -2.881994 -1.72975 -0.683924
C  -4.115258 -1.098216 -0.421444
C  -2.915667 0.80111 0.5846
C  -4.14935 0.187825 0.194924
C  -6.33214 -2.018156 0.124108
C  -1.788095 2.682689 1.682021
C  -5.642269 2.131293 -0.071792
H  1.797199 -0.341893 1.930093
H  3.502983 -0.184921 2.352712
H  2.155241 -1.727193 -1.522994
H  2.091189 -2.710192 -0.043619
H  1.890881 -2.815376 2.139951
H  2.698054 -2.12418 3.564684
H  3.672524 -2.79648 2.21904
H  5.073143 -0.563713 -1.861792
H  5.761348 -2.177887 -1.478518
H  4.078945 -2.0511 -2.027347
H  6.429834 -1.724691 0.650341
H  5.9221 -0.006017 0.620785
H  5.340765 -1.114163 1.915944
H  2.075776 0.236989 -2.132628
H  4.161855 1.500754 1.473716
H  2.238457 2.533331 -3.026617
H  4.322352 3.795445 0.570067
H  3.360641 4.349844 -1.690914
H  -0.734556 0.62646 0.59182
H  -2.870331 -2.704141 -1.179553
H  -5.945588 -2.696232 0.909511
H  -7.13361 -2.519102 -0.439735
H  -6.697797 -1.081179 0.574787
H  -1.250288 2.043045 2.407354
H  -1.123704 2.915255 0.828046
H  -2.108243 3.613928 2.171867
H  -4.972989 2.853612 0.42167
H  -5.495813 2.15454 -1.167779
H  -6.694448 2.3425 0.171807
