program: Gaussian 09
title: 000041081
version: EM64L-G09RevD.01
frameworkgroup: C1[X(C10H14O7)]
method: RPBEPBE
basis: SDD
operation: Freq
keyword: #pfreq=noraman
keyword: PBEPBE/SDD
title: #p freq=noraman PBEPBE/SDD
converged: YES YES NO NO
title: Mulliken charges:
elementType: O O O O O O O C C C C C C C C C C H H H H H H H H H H H H H H
charge: -0.264419 -0.261479 -0.271178 -0.152617 -0.237161 -0.269070 -0.257844 -0.051843 -0.061049 -0.332846 -0.088955 0.297693 0.337286 0.327383 -0.753030 -0.765592 -0.760952 0.264532 0.284139 0.248504 0.274033 0.178201 0.254532 0.257550 0.249503 0.255290 0.279180 0.244648 0.244996 0.282653 0.247912
chargesum: 0.00000
title: Mulliken charges with hydrogens summed into heavy atoms:
elementType: O O O O O O O C C C C C C C C C C
charge: -0.264419 -0.261479 -0.271178 -0.152617 -0.237161 -0.269070 -0.257844 0.212689 0.223090 0.189690 0.089245 0.297693 0.337286 0.327383 0.008556 0.013526 0.014609
polarizability: 1.61460915e+02 -2.79994877e+00 1.16332213e+02 -1.70909834e+00 8.23370398e+00 1.11891456e+02
1716.lowfreq: -12.2042 -8.5101 -0.0007 -0.0002 0.0006 4.1140 30.6563 40.0257 49.7510
frequency: 30.5127 39.9790 49.7325 54.2776 58.0522 68.1771 71.5609 74.8441 86.9243 106.5351 110.8835 114.8888 140.8892 165.6866 200.8126 201.6318 232.8561 281.5604 291.8817 304.8333 379.8474 410.6082 465.6096 490.5472 552.8369 560.9210 566.1982 574.1322 588.9824 619.1785 625.7987 674.9613 763.8874 795.2901 825.9528 880.1478 908.4049 961.1592 965.3331 987.2002 996.6610 999.1522 1005.8292 1020.5403 1043.7700 1047.3488 1048.7264 1116.7693 1134.0776 1179.4903 1185.8941 1203.9693 1218.2498 1254.0187 1290.0824 1301.5252 1342.8249 1356.7242 1383.1541 1385.0155 1387.4137 1388.2989 1451.8292 1452.9377 1453.1589 1454.4425 1455.1256 1457.8012 1473.4717 1647.9418 1656.0415 1658.6515 1664.9306 2871.3277 2947.0720 3002.8785 3005.8945 3009.1505 3028.1991 3041.8699 3098.4193 3100.5820 3103.1392 3116.8018 3143.1476 3144.9736 3145.5093
redmass: 10.2535 5.4748 2.6149 3.0890 3.2009 6.2607 2.9198 2.7835 3.2899 1.0383 1.1142 3.8439 5.2828 3.1368 6.1481 5.7923 7.5013 4.6158 3.1446 6.0156 3.1475 3.5264 3.9217 3.9843 3.3951 3.3106 3.4390 4.1331 5.4408 4.8201 4.2194 3.7439 3.8035 4.9306 2.7478 5.2198 4.8084 4.5162 2.3697 2.0065 3.3485 2.1368 2.0677 2.6452 1.6623 1.6352 1.6452 2.5947 2.7680 2.8969 3.0608 3.1220 1.1895 1.5074 1.4100 1.2284 1.5477 1.3442 1.2267 1.2293 1.2441 1.2264 1.0576 1.0567 1.0505 1.0550 1.0554 1.0558 1.0807 10.0769 9.7785 9.4054 8.9434 1.0855 1.0793 1.0394 1.0388 1.0376 1.0841 1.0566 1.0961 1.0926 1.0934 1.1093 1.1028 1.1026 1.1015
irintensity: 2.1195 0.9280 0.4804 3.4611 1.4415 2.3090 2.1365 3.8204 7.9382 0.4218 1.5284 0.5033 3.3194 7.7006 8.9315 16.1378 4.5742 5.1127 7.9378 10.6296 6.9738 18.3774 8.6921 1.9143 1.1949 1.8405 10.4462 1.0554 8.8438 3.5808 13.3705 33.7806 7.5468 24.2541 3.2290 15.7072 131.9036 78.6872 19.0461 33.0704 56.4387 33.6825 125.5525 40.4871 8.1221 20.0242 10.9124 12.9933 21.5965 24.0602 759.9768 89.3719 36.0527 12.7115 29.8212 10.5200 1.9780 3.8094 75.4207 68.4167 46.9314 9.3291 30.2952 24.3952 25.6671 7.4834 21.9529 10.4023 16.5698 135.6621 350.3387 34.1547 114.1483 102.5703 36.3071 1.1949 0.4655 0.6316 7.7845 19.2949 4.9643 7.0596 4.5646 4.0761 6.1952 6.7925 7.6572
temp: 298.150 k
press: 1.00000 atm
elementType: 8 8 8 8 8 8 8 6 6 6 6 6 6 6 6 6 6 1 1 1 1 1 1 1 1 1 1 1 1 1 1
symmnumber: 1
zpe: 611042.6 jmol-1
zpe.correction: 0.232734 hartree
zpe.thermalcorrener: 0.252628 hartree
zpe.thermalcorrenthalpy: 0.253572 hartree
zpe.thermalcorrgfe: 0.181487 hartree
zpe.sumelectzpe: -914.709982 hartree
zpe.sumelectthermal: -914.690088 hartree
zpe.sumelectthermalent: -914.689144 hartree
zpe.sumelectthermalfe: -914.761229 hartree
dipole: 0.8829 -1.6143 0.6873
dipole: 1.9641
quadrupole: -91.5338 -111.4564 -96.2482
quadrupole: 3.9474 6.1221 4.0565
quadrupole: 8.2123 -11.7103 3.4979 3.9474 6.1221 4.0565
hfenergy: -914.9427161 hartree
pointgroup: C01 [X(C10H14O7)]
dipole: -0.619148 -0.3682523 0.2795842 debye
polarizability: 116.6250366|1.5592344|161.4934023|8.0979494|2.7458294|111.5661456 unknown
InChI: InChI=1S/C10H14O7/c1-6(12)15-5-10(17-8(3)14)9(4-11)16-7(2)13/h4,9-10H,5H2,1-3H3
charge 0 multiplicity 1
31 atoms
O  0.00973 -2.06088 0.432041
O  1.231501 0.634223 0.543366
O  -1.926614 1.006854 -0.472115
O  3.157912 -0.679627 -1.013935
O  -1.594013 -3.411209 -0.598291
O  1.214375 2.674721 -0.591578
O  -1.642698 2.398485 1.387368
C  -0.430265 -0.914241 -0.41656
C  0.799728 -0.042336 -0.689107
C  -1.550418 -0.178321 0.337619
C  1.953737 -0.858974 -1.279089
C  -0.674984 -3.280778 0.23833
C  1.421832 2.0304 0.46113
C  -1.904547 2.264083 0.172398
C  -0.13635 -4.333349 1.175998
C  1.833588 2.583593 1.798255
C  -2.190033 3.365599 -0.816288
H  -0.818415 -1.317367 -1.371771
H  0.51782 0.735193 -1.435266
H  -2.44264 -0.820962 0.40988
H  -1.212857 0.140295 1.337819
H  1.620642 -1.625849 -2.025559
H  -0.442507 -4.100354 2.211644
H  0.965865 -4.342553 1.155916
H  -0.532989 -5.319327 0.89493
H  2.466095 1.866324 2.342965
H  0.918684 2.763706 2.392893
H  2.358962 3.540158 1.660943
H  -2.658149 4.218176 -0.301484
H  -1.22502 3.702622 -1.239588
H  -2.826673 3.009594 -1.639962
