program: Gaussian 09
title: 000005382
version: EM64L-G09RevD.01
frameworkgroup: C1[X(C16H8Cl4N2O2)]
method: RPBEPBE
basis: SDD
operation: Freq
keyword: #p
keyword: freq=noraman
keyword: PBEPBE/SDD
title: #p freq=noraman PBEPBE/SDD
converged: YES YES YES YES
title: Mulliken charges:
elementType: Cl Cl Cl Cl O O N N C C C C C C C C C C C C C C C C H H H H H H H H
charge: -0.001514 -0.001513 -0.036382 -0.036383 -0.290562 -0.290562 -0.011413 -0.011412 0.422053 0.422053 -0.333527 -0.333572 -0.333579 -0.333534 0.207694 0.207694 -0.234748 -0.234748 -0.048820 -0.048821 -0.062107 -0.062105 -0.347122 -0.347123 0.253840 0.253843 0.253846 0.253842 0.289499 0.289499 0.272842 0.272843
chargesum: 0.00000
title: Mulliken charges with hydrogens summed into heavy atoms:
elementType: Cl Cl Cl Cl O O N N C C C C C C C C C C C C C C C C
charge: -0.001514 -0.001513 -0.036382 -0.036383 -0.290562 -0.290562 -0.011413 -0.011412 0.422053 0.422053 -0.079687 -0.079729 -0.079733 -0.079692 0.207694 0.207694 -0.234748 -0.234748 0.240679 0.240678 -0.062107 -0.062105 -0.074280 -0.074280
polarizability: 3.33310911e+02 -3.10795523e-05 2.66737673e+02 1.45977591e-02 -1.73517233e-02 1.21673389e+02
1716.lowfreq: -34.2537 -10.4599 -3.7657 -0.0033 -0.0028 -0.0022 3.1600 5.4855 17.1144
frequency: -34.2487 -10.2016 17.1144 20.5945 34.9608 52.7059 84.7798 91.4472 112.5685 139.3360 161.0118 161.1756 164.6554 199.4150 217.1101 297.4079 311.2330 327.8474 346.4437 362.5693 363.5847 378.1103 408.6164 414.0055 414.8326 422.2146 449.2298 450.1947 490.7058 494.9834 546.1553 546.4877 602.5047 623.8543 627.6802 644.1716 659.1816 692.8454 725.8597 725.9375 739.0946 762.5849 801.6225 816.5942 848.2345 866.0533 875.3393 878.0941 878.1912 893.9494 894.2393 949.5565 960.7636 1002.8621 1010.0101 1010.9521 1094.7888 1095.6927 1096.9019 1147.4382 1154.9015 1188.1825 1223.0364 1224.7186 1247.1658 1257.1830 1282.1071 1329.0632 1329.4888 1359.0174 1359.9971 1378.0194 1401.9699 1407.4045 1412.4402 1479.7326 1533.6667 1533.9783 1555.9014 1557.1186 1608.1008 1608.4395 3160.9346 3161.1501 3166.8299 3166.8737 3178.0502 3181.9869 3183.5731 3183.5743
redmass: 3.9152 17.0570 13.7873 10.6744 9.0454 14.1197 8.9607 8.4712 25.4093 9.0205 6.6215 6.6509 18.6750 13.8452 10.9426 8.5038 9.8709 7.8056 10.1986 10.9822 8.9655 14.8731 11.3864 2.9332 8.5471 5.1604 4.7668 4.8274 3.6139 6.9176 4.0191 4.0214 8.8758 10.1942 7.2401 5.5233 6.1500 5.9158 7.1116 7.0940 5.5435 7.5321 6.7472 1.2458 1.9683 6.8116 6.3335 1.4222 1.4206 1.3725 1.3725 1.3873 1.3626 3.0043 5.7134 6.1234 2.3319 2.3458 1.2672 2.4791 1.2766 3.3997 1.7848 1.8707 4.5428 4.7625 1.2546 5.9016 5.9119 3.4995 3.3948 8.3585 3.6012 2.5811 2.7450 2.6092 9.3005 9.2065 7.6248 7.6346 8.2678 6.6736 1.0892 1.0888 1.0934 1.0934 1.0978 1.0985 1.0942 1.0942
irintensity: 0.0621 0.0000 0.0177 0.0812 0.0000 0.0020 0.0829 0.0000 0.5525 1.0794 0.3883 0.0000 2.1967 0.3845 0.0318 7.7883 10.0321 0.0000 0.8673 3.5016 7.2125 0.0000 2.6915 0.0000 7.8969 0.0000 0.8913 0.0000 26.4935 0.9824 0.0000 7.6237 25.0852 2.1738 0.0000 0.8853 0.0014 45.8770 0.0000 28.0397 1.6105 5.6400 101.5864 0.1595 77.3153 26.0848 0.3456 0.0000 55.6227 0.0000 7.7812 0.8885 0.0000 39.9753 245.7816 14.0132 76.7790 20.1855 14.9704 338.8171 0.9282 8.4742 27.9926 0.3322 454.9099 103.9703 0.0000 1.3425 22.3028 29.1533 69.6610 2.0824 2.0175 472.8598 445.0777 208.2880 26.7273 0.1571 0.7968 66.4263 0.0000 3.2804 0.0009 14.9003 2.3758 8.6216 3.5498 0.2280 1.7163 0.0953
temp: 298.150 k
press: 1.00000 atm
elementType: 17 17 17 17 8 8 7 7 6 6 6 6 6 6 6 6 6 6 6 6 6 6 6 6 1 1 1 1 1 1 1 1
symmnumber: 1
zpe: 527679.4 jmol-1
zpe.correction: 0.200982 hartree
zpe.thermalcorrener: 0.220611 hartree
zpe.thermalcorrenthalpy: 0.221555 hartree
zpe.thermalcorrgfe: 0.149273 hartree
zpe.sumelectzpe: -2712.986994 hartree
zpe.sumelectthermal: -2712.967365 hartree
zpe.sumelectthermalent: -2712.966421 hartree
zpe.sumelectthermalfe: -2713.038703 hartree
dipole: 0.0000 1.1256 -0.0001
dipole: 1.1256
quadrupole: -159.9046 -173.3152 -157.2375
quadrupole: 0.0001 -0.0003 0.0005
quadrupole: 3.5812 -9.8295 6.2483 0.0001 -0.0003 0.0005
hfenergy: -2713.1879761 hartree
pointgroup: C01 [X(C16H8Cl4N2O2)]
dipole: -0.0000028 -0.4428434 -0.0000519 debye
polarizability: 333.3109114|-0.0007894|266.7376726|-0.0145976|0.0173519|121.6733891 unknown
InChI: InChI=1S/C16H8Cl4N2O2/c17-9-5-13(19)15(21-7-9)23-11-1-2-12(4-3-11)24-16-14(20)6-10(18)8-22-16/h1-8H
charge 0 multiplicity 1
32 atoms
Cl -5.767603 2.169437 0.000975
Cl 5.76767 2.169307 -0.000676
Cl -6.176955 -3.395573 -0.000714
Cl 6.176898 -3.395714 -0.00002
O  -2.817788 1.53224 0.000337
O  2.817842 1.532176 -0.000072
N  -3.00412 -0.835149 -0.000471
N  3.00412 -0.835218 0.000294
C  -1.387552 1.411921 0.000214
C  1.387603 1.411889 0.000035
C  -0.705556 1.416346 -1.231281
C  0.705442 1.41633 -1.23137
C  -0.705391 1.416363 1.231618
C  0.705608 1.416346 1.231529
C  -3.592601 0.378204 -0.000083
C  3.592629 0.378121 0.000117
C  -5.006988 0.52965 0.000255
C  5.007019 0.529537 -0.000234
C  -5.814092 -0.619011 0.000056
C  5.814097 -0.619143 -0.000268
C  -5.176315 -1.880808 -0.000417
C  5.176291 -1.880925 -0.000012
C  -3.771605 -1.960522 -0.00065
C  3.77158 -1.960608 0.000239
H  -1.270128 1.427043 -2.167906
H  1.2699 1.427018 -2.168063
H  -1.269851 1.427079 2.168309
H  1.270183 1.427044 2.168152
H  -6.903672 -0.534385 0.000284
H  6.903679 -0.534542 -0.000508
H  -3.248948 -2.921191 -0.001018
H  3.248902 -2.921265 0.000447
