program: Gaussian 09
title: 000005363
version: EM64L-G09RevD.01
frameworkgroup: C1[X(C8H15NO3)]
method: RPBEPBE
basis: SDD
operation: Freq
keyword: #p
keyword: freq=noraman
keyword: PBEPBE/SDD
title: #p freq=noraman PBEPBE/SDD
converged: YES YES NO NO
title: Mulliken charges:
elementType: O O O N C C C C C C C C H H H H H H H H H H H H H H H
charge: -0.459112 -0.487271 -0.450371 -0.130277 -0.058348 -0.133330 -0.109644 -0.124206 -0.406711 -0.382077 -0.460280 -0.390482 0.231955 0.236854 0.215932 0.227078 0.226757 0.183284 0.175930 0.216646 0.208560 0.213895 0.195731 0.215430 0.360319 0.347812 0.335924
chargesum: 0.00000
title: Mulliken charges with hydrogens summed into heavy atoms:
elementType: O O O N C C C C C C C C
charge: -0.098793 -0.139459 -0.114447 -0.130277 0.173607 0.103523 0.106289 0.102872 0.003331 0.010499 -0.037824 0.020679
polarizability: 1.12041095e+02 3.98582029e+00 1.03530233e+02 2.03939055e+00 9.56930153e-01 8.00980104e+01
1716.lowfreq: -14.9106 -0.0009 -0.0008 -0.0005 7.5103 11.5031 50.8106 94.0867 155.1706
frequency: 50.6392 94.0715 155.1659 174.9564 182.7568 224.5327 267.1438 276.2364 300.9093 341.3866 353.2866 378.7695 400.6282 445.5305 473.2277 497.6756 511.4622 540.1630 568.9556 651.1548 823.6719 836.2243 875.0214 889.9606 899.5970 944.3889 960.7294 996.0400 1008.7569 1022.8580 1037.6971 1047.9090 1080.0588 1099.6060 1111.0187 1127.6168 1159.8282 1166.0118 1176.6456 1191.1747 1213.8167 1229.5834 1237.6417 1246.0443 1269.0947 1278.5803 1300.8403 1311.3603 1312.3536 1330.1477 1339.0883 1340.1725 1348.1137 1366.7663 1402.6836 1412.7137 1456.5787 1459.8606 1469.8326 1476.6384 2822.9523 2830.1516 2852.0229 2971.6453 2975.7588 2992.0891 2994.5667 3012.6885 3028.3627 3035.7880 3037.6052 3060.2730 3509.3512 3565.3266 3578.4926
redmass: 4.2011 4.3062 2.8452 3.3529 3.6712 1.1678 1.1491 2.3642 3.2856 2.7742 3.8903 3.3397 3.6662 3.4140 3.0342 1.4245 2.7753 2.7200 2.4037 3.7588 2.2266 2.5520 1.6490 2.3924 3.6172 2.0181 2.7453 4.2417 4.1197 2.3578 2.1075 2.3069 1.8470 2.1270 1.6765 2.2431 1.6717 1.3538 1.2983 1.6237 1.2998 1.5715 1.3712 1.1777 1.5239 1.3430 1.2590 1.3104 1.3559 1.2974 1.4674 1.3266 1.3952 1.4707 1.7153 1.8287 1.0891 1.0879 1.1155 1.0914 1.0740 1.0745 1.0705 1.0838 1.0604 1.0849 1.0623 1.0862 1.0889 1.0915 1.0979 1.1033 1.0654 1.0663 1.0664
irintensity: 2.3486 0.4381 7.8852 2.2342 4.1865 150.9043 97.5000 2.2307 6.9629 11.6618 16.9676 9.4943 0.6427 7.8214 9.8459 105.0988 70.3634 7.9914 11.0400 6.6274 3.4582 19.5278 4.9155 2.0502 16.1743 12.8306 68.6431 22.5027 134.8683 4.8936 22.9039 25.4033 17.3269 19.7788 7.8546 14.0343 34.7424 49.2453 17.6239 19.3069 12.9658 11.0475 3.9173 25.3543 12.9036 4.1271 5.3983 25.5696 12.4234 7.2104 27.2498 5.1382 3.5754 3.6392 2.1132 13.6254 13.6834 6.8300 7.1267 8.9974 44.7298 61.0928 158.4160 21.0363 47.4686 27.5557 29.7145 51.0313 38.0471 39.0812 58.3461 57.5004 29.2626 4.1244 4.3290
temp: 298.150 k
press: 1.00000 atm
elementType: 8 8 8 7 6 6 6 6 6 6 6 6 1 1 1 1 1 1 1 1 1 1 1 1 1 1 1
symmnumber: 1
zpe: 600599.8 jmol-1
zpe.correction: 0.228756 hartree
zpe.thermalcorrener: 0.240618 hartree
zpe.thermalcorrenthalpy: 0.241563 hartree
zpe.thermalcorrgfe: 0.191556 hartree
zpe.sumelectzpe: -593.267043 hartree
zpe.sumelectthermal: -593.255181 hartree
zpe.sumelectthermalent: -593.254236 hartree
zpe.sumelectthermalfe: -593.304243 hartree
dipole: 3.0420 -1.9387 -0.2702
dipole: 3.6174
quadrupole: -65.9561 -68.7411 -75.3834
quadrupole: 11.4749 4.6273 5.7020
quadrupole: 4.0708 1.2858 -5.3565 11.4749 4.6273 5.7020
hfenergy: -593.495799 hartree
pointgroup: C01 [X(C8H15N1O3)]
dipole: -1.1968404 0.7604453 -0.1215648 debye
polarizability: 112.0515813|3.9667534|103.5034814|-1.9742401|-1.2728605|80.1142757 unknown
InChI: InChI=1S/C8H15NO3/c10-5-2-1-3-9-4-6(11)8(12)7(5)9/h5-8,10-12H,1-4H2
charge 0 multiplicity 1
27 atoms
O  1.609427 -2.026597 -0.630722
O  -1.328363 -2.36207 0.081519
O  3.002452 0.555741 1.023896
N  -0.074095 1.13429 0.018596
C  -0.167126 -0.311294 -0.276354
C  1.225272 -0.836838 0.125534
C  -1.348706 -0.930628 0.466668
C  2.182641 0.340558 -0.179396
C  1.247556 1.54489 -0.514985
C  -1.262123 1.88973 -0.414082
C  -2.650585 -0.213515 0.056798
C  -2.515773 1.316528 0.289889
H  -0.313075 -0.510706 -1.372467
H  1.25576 -1.025614 1.217952
H  -1.184457 -0.828381 1.560688
H  2.821398 0.073643 -1.04381
H  1.594515 2.482203 -0.043853
H  1.215424 1.694731 -1.625086
H  -1.399987 1.835744 -1.527455
H  -1.132992 2.9549 -0.146094
H  -3.515934 -0.610763 0.623684
H  -2.834278 -0.41832 -1.017002
H  -3.420459 1.833331 -0.081451
H  -2.432758 1.521645 1.3743
H  0.856043 -2.669032 -0.535416
H  -2.040997 -2.847423 0.5666
H  3.753922 1.161246 0.80235
