program: Gaussian 09
title: 000041058
version: EM64L-G09RevD.01
frameworkgroup: C1[X(C22H23NO8)]
method: RPBEPBE
basis: SDD
operation: Freq
keyword: #p
keyword: freq=noraman
keyword: PBEPBE/SDD
title: #p freq=noraman PBEPBE/SDD
converged: YES YES NO NO
title: Mulliken charges:
elementType: O O O O O O O O N C C C C C C C C C C C C C C C C C C C C C C H H H H H H H H H H H H H H H H H H H H H H H
charge: -0.266912 -0.431633 -0.300590 -0.290977 -0.260873 -0.181683 -0.250483 -0.282213 -0.016440 -0.256057 -0.243099 -0.400983 0.248211 -0.536423 0.465831 -0.609337 0.466626 0.058588 -0.569861 -0.014370 0.033378 0.201260 0.123677 -0.486830 0.067404 -0.345368 0.232159 -0.198651 -0.522674 -0.506957 -0.535892 0.314488 0.259327 0.272196 0.228505 0.215780 0.264639 0.246313 0.207108 0.276634 0.258593 0.238899 0.242053 0.239283 0.227520 0.229831 0.222290 0.258783 0.240474 0.216286 0.254282 0.222769 0.227720 0.247398
chargesum: 0.00000
title: Mulliken charges with hydrogens summed into heavy atoms:
elementType: O O O O O O O O N C C C C C C C C C C C C C C C C C C C C C C
charge: -0.266912 -0.431633 -0.300590 -0.290977 -0.260873 -0.181683 -0.250483 -0.282213 -0.016440 0.058431 0.016228 0.099718 0.248211 -0.056003 0.465831 0.120718 0.466626 0.058588 -0.311268 -0.014370 0.033378 0.201260 0.123677 -0.247931 0.067404 -0.103315 0.232159 0.268152 0.188231 0.204085 0.161995
polarizability: 3.17996201e+02 3.68189472e+01 2.69142568e+02 -2.59513870e+01 2.35061691e+01 2.45821874e+02
1716.lowfreq: -7.2614 -5.8616 -3.7426 0.0006 0.0007 0.0009 9.0066 16.3276 23.3069
frequency: 8.1723 16.1770 23.1958 35.5887 49.2552 52.5603 64.6933 84.3599 95.2993 108.5150 119.0920 128.5901 135.4629 137.0454 144.0818 175.7013 191.8779 192.6706 197.9850 207.4735 220.6286 222.6968 236.7241 245.3392 251.2699 268.7469 289.5262 301.5196 305.1044 327.7886 332.7046 343.6293 359.9561 372.7523 409.9307 423.3875 445.5499 459.7371 485.0705 500.8741 509.5947 525.7984 532.5536 549.1959 569.1485 580.1429 599.1475 620.3802 642.8601 650.8377 662.7243 683.0178 690.3969 708.3033 718.2024 725.4297 745.4677 774.2731 793.4271 806.6831 810.3169 823.6585 828.4692 840.3573 851.4285 883.5161 895.9379 904.2128 921.1400 924.3859 938.0567 951.0132 966.3791 980.9923 988.4262 1016.6893 1033.4647 1052.4012 1063.1069 1068.1811 1076.9209 1091.7210 1107.7344 1111.8930 1113.8518 1132.3283 1138.7342 1140.6054 1144.3551 1148.3290 1160.2260 1176.3294 1182.5142 1196.3703 1204.3544 1216.5011 1233.4271 1241.6029 1250.8223 1263.9305 1268.4236 1290.3667 1294.6410 1315.7718 1355.1152 1360.4500 1365.0439 1380.1905 1405.5804 1410.9021 1414.9907 1419.7773 1427.4671 1432.2029 1443.5001 1446.0738 1451.2664 1455.4225 1456.0065 1458.1576 1460.6879 1467.7851 1468.1092 1469.9731 1472.8145 1476.5201 1478.0554 1485.5179 1600.6056 1611.7568 1614.8845 1628.1022 1714.6031 2963.1423 2983.0099 2984.1169 2988.4325 2990.2183 2994.9301 3016.3095 3030.5689 3051.7948 3053.2841 3053.7577 3088.1479 3098.4841 3104.6628 3109.7455 3119.9017 3124.4397 3127.0754 3137.8031 3143.7745 3144.8253 3166.0531 3170.2768
redmass: 4.4503 3.1981 2.8753 3.9276 4.1522 3.1776 4.1303 5.1087 3.4850 2.8122 2.4394 3.3516 1.7175 3.8658 4.2939 2.6802 3.6698 3.9025 3.5329 3.8859 2.7435 3.9665 4.4132 1.3559 2.1922 2.1661 4.1856 4.4520 3.1634 4.6449 4.9342 4.4458 4.2194 6.0375 3.6761 6.5905 4.8931 6.3169 4.2726 4.5619 5.9395 3.8815 4.8542 5.4322 6.2205 5.7484 5.5160 6.7970 4.9741 5.1790 6.0617 8.6832 7.7615 4.7971 3.9496 5.6885 5.4487 4.7346 3.4446 4.3682 2.2511 5.9848 5.5347 7.7242 1.6545 3.6159 3.4454 4.5151 3.9421 1.7779 4.2546 4.8232 3.7320 6.2790 5.8621 4.4134 2.7270 5.9339 2.2091 3.4781 1.5332 2.5312 1.2309 1.2565 1.2443 1.5503 1.1194 1.6661 1.4731 1.3408 1.4795 1.4704 1.5903 2.5571 2.4796 1.7190 1.5533 1.3469 1.9526 1.6402 2.5181 1.7877 2.2701 1.5992 1.7136 1.2543 1.3576 4.5699 1.1966 1.9155 2.6888 2.4545 1.5703 1.3228 1.4044 1.0716 1.7516 1.1749 1.2800 1.2923 1.6029 1.0566 1.0569 1.2484 1.0556 1.0630 1.1862 2.0372 8.0682 8.3433 9.2988 9.4223 12.9281 1.0327 1.0341 1.0607 1.0328 1.0372 1.0593 1.0816 1.0607 1.0863 1.1043 1.0952 1.1023 1.0995 1.1064 1.0990 1.1063 1.1041 1.0996 1.1053 1.0886 1.1023 1.0955 1.0930
irintensity: 1.0640 2.7072 4.6128 2.8695 1.2022 10.1697 0.9705 0.0908 3.9504 10.1237 2.1340 10.0342 2.6819 1.7681 1.2598 1.4003 6.5628 1.7523 1.4879 0.8887 7.7766 0.7920 3.8425 0.2591 5.9697 1.6448 0.9718 3.8195 4.0625 2.8869 4.1585 9.8321 10.9028 15.5754 15.0219 0.7739 4.3718 3.9589 3.3065 13.6428 7.7516 1.2144 6.6434 2.0198 1.3923 1.3700 11.9823 2.1485 19.6031 5.7614 4.2424 0.7100 5.2017 3.1807 1.6473 4.7219 11.7017 1.8796 5.9782 33.0897 35.9465 79.5306 13.8907 29.8623 3.7197 89.5060 7.2042 25.1119 7.2017 7.9891 89.6615 46.1927 14.4623 127.5867 36.8594 78.2452 14.2951 46.7720 18.2799 30.1687 13.2022 24.8655 5.0961 0.0498 3.0206 11.9599 4.8550 15.1980 5.0156 1.2611 11.6669 5.5637 20.5743 14.6018 47.9674 88.4892 29.8302 30.1625 152.3430 38.7799 55.6079 57.7860 40.6662 24.8977 34.6769 2.2401 4.7531 94.5102 5.9076 13.9138 1.7650 17.2676 15.4434 0.7536 22.1485 8.0355 30.7511 39.2085 8.8591 86.2202 46.8749 17.8263 17.6184 129.9305 18.3253 25.9871 5.6436 84.4048 24.1943 4.4915 51.3554 26.8404 344.6585 65.1224 70.2398 93.8824 74.5880 29.1786 20.2106 19.2343 24.9847 6.3302 39.7134 19.3104 22.3350 37.5494 6.8977 14.5375 28.6282 16.9216 21.5753 11.7804 8.9779 7.5599 11.0066 2.2958
temp: 298.150 k
press: 1.00000 atm
elementType: 8 8 8 8 8 8 8 8 7 6 6 6 6 6 6 6 6 6 6 6 6 6 6 6 6 6 6 6 6 6 6 1 1 1 1 1 1 1 1 1 1 1 1 1 1 1 1 1 1 1 1 1 1 1
symmnumber: 1
zpe: 1092062.1 jmol-1
zpe.correction: 0.415944 hartree
zpe.thermalcorrener: 0.445304 hartree
zpe.thermalcorrenthalpy: 0.446248 hartree
zpe.thermalcorrgfe: 0.353599 hartree
zpe.sumelectzpe: -1506.242568 hartree
zpe.sumelectthermal: -1506.213209 hartree
zpe.sumelectthermalent: -1506.212265 hartree
zpe.sumelectthermalfe: -1506.304913 hartree
dipole: 6.0323 0.0773 -4.6985
dipole: 7.6466
quadrupole: -167.7703 -154.6860 -188.1617
quadrupole: 8.7210 -27.1687 2.6721
quadrupole: 2.4357 15.5200 -17.9557 8.7210 -27.1687 2.6721
hfenergy: -1506.6585127 hartree
pointgroup: C01 [X(C22H23N1O8)]
dipole: 2.3758966 -0.3003746 -1.820803 debye
polarizability: 328.9902115|27.3745152|257.3335828|-19.8868474|28.0751612|246.6368484 unknown
InChI: InChI=1S/C22H23NO8/c1-23(25)8-7-11-9-14-20(30-10-29-14)21(28-4)15(11)17(23)18-12-5-6-13(26-2)19(27-3)16(12)22(24)31-18/h5-6,9,17-18H,7-8,10H2,1-4H3
charge 0 multiplicity 1
54 atoms
O  -0.809272 -1.547328 1.549789
O  -4.021203 -0.969972 -1.595181
O  -0.017181 0.755944 -1.937834
O  -0.000663 3.687262 -0.948721
O  -1.564058 4.467507 0.682506
O  0.586625 -0.645273 3.190575
O  3.39936 -0.463175 2.03521
O  4.873009 -0.875128 -0.36507
N  -3.209278 -1.662566 -0.64428
C  -1.772274 -1.072515 -0.728644
C  -0.727954 -1.892758 0.106591
C  -3.749675 -1.459856 0.785808
C  -1.818588 0.401215 -0.348081
C  -3.940947 0.037167 1.026364
C  -2.767026 0.896604 0.584194
C  -3.24385 -3.141528 -0.996895
C  0.729189 -1.660423 -0.248608
C  -0.87097 1.283772 -0.954661
C  -2.74228 2.256426 0.99806
C  1.411111 -1.162241 0.884504
C  -0.842387 2.615315 -0.511754
C  -1.760532 3.076655 0.448783
C  0.466571 -1.044449 2.025517
C  1.406679 -1.902431 -1.448405
C  2.795973 -0.868387 0.853227
C  2.79159 -1.626071 -1.503177
C  3.489036 -1.120228 -0.377624
C  -0.266906 4.769196 0.039395
C  0.285971 1.628645 -3.092674
C  4.37746 0.647018 2.027141
C  5.631053 -1.177569 -1.582014
H  -1.509381 -1.168361 -1.796665
H  -0.964387 -2.970261 0.031414
H  -3.037476 -1.903121 1.501456
H  -4.715786 -1.989286 0.819484
H  -4.169152 0.200644 2.095874
H  -4.816152 0.359478 0.430915
H  -2.693746 -3.277111 -1.940691
H  -2.836988 -3.790001 -0.200085
H  -4.305882 -3.367333 -1.167968
H  -3.476636 2.644589 1.708367
H  0.886873 -2.278335 -2.334727
H  3.334503 -1.820565 -2.432849
H  -0.341409 5.728407 -0.493085
H  0.532295 4.753726 0.806885
H  -0.64724 1.909418 -3.615524
H  0.918891 1.013993 -3.750874
H  0.825173 2.536681 -2.775773
H  4.558461 0.852176 3.092451
H  3.938711 1.538159 1.540945
H  5.30585 0.354089 1.513361
H  5.291064 -0.557411 -2.433913
H  5.554727 -2.250203 -1.844708
H  6.674001 -0.929802 -1.336429
