program: Gaussian 09
title: 000005356
version: EM64L-G09RevD.01
frameworkgroup: C1[X(C10H14N2O4S2)]
method: RPBEPBE
basis: SDD
operation: Freq
keyword: #p
keyword: freq=noraman
keyword: PBEPBE/SDD
title: #p freq=noraman PBEPBE/SDD
converged: YES YES NO NO
title: Mulliken charges:
elementType: S S O O O O N N C C C C C C C C C C H H H H H H H H H H H H H H
charge: 0.968032 0.948098 -0.521483 -0.520426 -0.536023 -0.540730 -0.349380 -0.718116 -0.389467 -0.569794 -0.370524 -0.452913 0.397134 -0.305615 -0.305016 -0.054213 -0.238047 -0.231223 0.257116 0.240656 0.279103 0.293930 0.219837 0.214818 0.254596 0.251201 0.258091 0.282041 0.284405 0.285127 0.334467 0.334319
chargesum: 0.00000
title: Mulliken charges with hydrogens summed into heavy atoms:
elementType: S S O O O O N N C C C C C C C C C C
charge: 0.968032 0.948098 -0.521483 -0.520426 -0.536023 -0.540730 -0.349380 -0.049330 0.108305 0.003239 0.064130 0.052884 0.397134 -0.047524 -0.022974 -0.054213 0.046358 0.053904
polarizability: 3.07761995e+02 -5.32652133e+00 1.70102754e+02 -3.89318343e+00 -1.36808229e+01 1.38161671e+02
1716.lowfreq: -13.9004 -0.0010 0.0015 0.0020 4.8008 5.8706 15.8154 36.1794 59.4775
frequency: -5.1584 35.9939 59.4101 64.6303 95.1161 102.6371 117.9349 141.2752 165.1254 171.5313 178.5579 219.3541 230.0875 254.7159 264.3848 278.3161 305.8347 319.8186 341.1105 350.7886 366.4916 388.6576 404.1384 415.7989 421.1274 460.4306 480.6369 489.9080 543.5707 562.9246 614.2203 640.6428 731.3938 764.3665 794.9911 803.8041 811.1365 820.7495 828.3704 838.7680 851.6725 882.5585 907.5525 938.2067 948.7373 961.2906 964.2533 974.7073 989.7358 1023.4899 1055.0011 1058.9286 1069.6161 1111.2425 1122.4409 1136.9709 1180.4469 1184.4199 1228.5660 1250.8522 1262.1311 1290.1251 1297.0440 1350.1231 1360.8153 1365.1035 1380.3171 1405.9592 1410.1182 1446.4422 1453.8729 1457.8822 1468.3464 1533.3509 1577.5850 1586.0948 2948.9397 2990.3225 2997.6769 3037.1944 3043.6635 3052.5065 3063.7683 3144.5079 3153.3058 3161.1094 3172.0175 3188.4722 3361.4371 3528.7753
redmass: 5.2350 6.6190 3.6367 4.2303 6.4219 1.7172 4.4739 7.6094 6.8045 6.4905 5.2164 4.3344 4.6136 3.8929 2.6751 6.1464 4.6217 6.2659 3.4085 3.3819 6.7948 7.9062 4.0309 2.9711 6.6307 5.4905 4.0996 2.0184 2.9963 4.2012 6.7213 5.5125 3.3718 3.1814 3.1138 4.0535 2.5702 2.2367 1.4406 2.0833 1.8124 1.6777 4.0148 6.3512 2.8330 2.2039 1.4588 1.3991 4.5694 2.5843 2.4400 1.5475 1.4884 1.8493 1.3771 1.3780 1.2947 1.1770 2.4068 1.4095 1.3864 1.1767 1.2687 1.3523 1.4703 1.4308 3.9624 3.7642 1.1106 1.1010 1.0888 1.1768 1.7970 1.0853 6.7963 6.4427 1.0643 1.0604 1.0626 1.0959 1.0865 1.0709 1.1014 1.1106 1.0883 1.0904 1.0962 1.0960 1.0414 1.0999
irintensity: 1.6212 0.5350 2.4536 3.4567 5.3789 37.1916 1.9529 1.0259 0.2917 15.3695 0.2098 4.8564 7.1852 7.4914 6.5715 27.7345 8.0732 6.1636 6.3776 10.2540 40.0788 10.2668 31.0218 0.1234 38.3802 35.8889 167.5707 25.6673 42.8518 77.3750 0.8148 6.5126 5.4044 6.5610 16.0345 26.5774 254.2769 8.9361 8.6418 3.1575 72.6240 18.9565 57.0809 56.0294 5.1954 16.5889 4.1174 0.5238 0.3546 4.4450 42.4007 5.7908 28.3630 0.2338 4.9038 4.9199 5.8948 12.5524 52.8260 0.7531 1.1340 10.8538 0.8093 3.0052 3.6826 0.9362 2.9906 17.9191 8.7754 30.8071 14.4462 10.4298 34.3634 18.5541 8.7689 6.8442 18.1047 14.1939 37.6837 9.5466 10.3974 2.6554 28.8784 1.3050 1.5733 1.0880 5.9528 1.0679 29.4784 23.8199
temp: 298.150 k
press: 1.00000 atm
elementType: 16 16 8 8 8 8 7 7 6 6 6 6 6 6 6 6 6 6 1 1 1 1 1 1 1 1 1 1 1 1 1 1
symmnumber: 1
zpe: 617323.6 jmol-1
zpe.correction: 0.235126 hartree
zpe.thermalcorrener: 0.253459 hartree
zpe.thermalcorrenthalpy: 0.254403 hartree
zpe.thermalcorrgfe: 0.188933 hartree
zpe.sumelectzpe: -1594.267153 hartree
zpe.sumelectthermal: -1594.248820 hartree
zpe.sumelectthermalent: -1594.247876 hartree
zpe.sumelectthermalfe: -1594.313346 hartree
dipole: -5.7860 -5.7911 -5.0721
dipole: 9.6302
quadrupole: -103.9610 -125.2175 -130.0487
quadrupole: -0.9320 -5.0868 -5.6633
quadrupole: 15.7814 -5.4751 -10.3063 -0.9320 -5.0868 -5.6633
hfenergy: -1594.5022789 hartree
pointgroup: C01 [X(C10H14N2O4S2)]
dipole: -2.3635597 2.8718776 0.7217804 debye
polarizability: 306.9755445|11.7452231|151.7087304|-3.5235923|-21.1615298|157.3421443 unknown
InChI: InChI=1S/C10H14N2O4S2/c11-18(15,16)10-5-3-9(4-6-10)12-7-1-2-8-17(12,13)14/h3-6H,1-2,7-8,11H2
charge 0 multiplicity 1
32 atoms
S  -2.701988 -1.202727 0.286088
S  4.28857 -0.040589 -0.217305
O  -3.001086 -1.715813 -1.236966
O  -1.972865 -2.178857 1.359548
O  4.74066 -1.266782 0.754173
O  4.690054 0.060523 -1.793343
N  -1.750118 0.577485 0.279812
N  4.918425 1.505511 0.572409
C  -4.854475 0.564014 0.011903
C  -4.340381 -0.481784 1.005516
C  -3.901586 1.77195 -0.157348
C  -2.504221 1.41222 -0.709076
C  -0.344598 0.413443 0.092162
C  0.344577 0.856983 -1.075256
C  0.38669 -0.202824 1.15116
C  2.423647 0.140124 -0.090215
C  1.744903 0.738549 -1.162919
C  1.782367 -0.351407 1.059468
H  -5.03292 0.074589 -0.964712
H  -5.838447 0.914996 0.379401
H  -4.023994 -0.07608 1.978749
H  -4.993993 -1.361381 1.12117
H  -4.368572 2.494866 -0.852737
H  -3.772188 2.285216 0.814516
H  -2.586276 0.917018 -1.701157
H  -1.924122 2.34421 -0.844607
H  -0.205375 1.290168 -1.915332
H  -0.151616 -0.555671 2.034092
H  2.294298 1.064202 -2.051896
H  2.35627 -0.843561 1.850579
H  5.468965 2.017532 -0.137614
H  5.478296 1.231179 1.397439
