program: Gaussian 09
title: 000040925
version: EM64L-G09RevD.01
frameworkgroup: C1[X(C7H16O2)]
method: RPBEPBE
basis: SDD
operation: Freq
keyword: #pfreq=noraman
keyword: PBEPBE/SDD
title: #p freq=noraman PBEPBE/SDD
converged: YES YES NO NO
title: Mulliken charges:
elementType: O O C C C C C C C H H H H H H H H H H H H H H H H
charge: -0.307876 -0.466085 0.098512 -0.379419 -0.240715 -0.073440 -0.714880 -0.693772 -0.699037 0.165525 0.209806 0.186303 0.211462 0.184603 0.201347 0.223397 0.223465 0.211460 0.236400 0.200861 0.212441 0.203982 0.243482 0.220543 0.341633
chargesum: 0.00000
title: Mulliken charges with hydrogens summed into heavy atoms:
elementType: O O C C C C C C C
charge: -0.307876 -0.124452 0.264037 0.016690 0.155350 0.127907 -0.056558 -0.044070 -0.031030
polarizability: 9.99336893e+01 8.74828630e-01 8.47708441e+01 -1.14065636e-01 -1.08591171e+00 6.94789471e+01
1716.lowfreq: -0.0011 -0.0009 -0.0005 5.1000 8.9097 29.2699 37.1026 58.8111 98.4263
frequency: 36.6353 58.6480 98.3688 111.6941 143.7483 192.7891 212.6804 233.8795 247.6645 266.9761 271.3801 345.8275 368.1624 431.9211 432.8093 479.4499 509.7347 755.4653 812.8382 838.4643 866.5060 924.1502 929.5442 962.7177 982.2760 1023.7136 1042.6691 1067.0712 1086.5722 1115.1666 1117.5470 1129.2913 1176.3026 1201.2168 1243.0766 1266.0970 1296.0902 1308.5188 1327.7170 1352.8391 1360.5823 1380.1627 1381.2008 1388.0364 1403.2105 1450.5498 1463.8025 1466.0851 1473.2291 1475.0676 1476.7759 1485.8693 1489.3344 2911.1581 2938.1229 2966.7508 2976.9693 2979.2863 2980.6656 2986.6691 3009.7040 3038.9088 3070.3675 3071.3908 3076.1169 3085.7723 3092.2645 3093.3482 3571.0294
redmass: 2.8479 3.5054 2.6116 1.9950 2.5195 1.3556 1.3710 1.8420 1.1420 1.0836 2.0528 3.3230 2.6061 2.7397 2.4026 2.7472 2.9191 1.6932 1.7625 2.2832 2.3352 1.3420 2.1222 1.3832 1.4407 2.9201 3.7612 1.8697 2.0316 1.8364 2.0220 1.8618 1.9620 1.3140 1.2353 1.2075 1.2802 1.1799 1.2315 1.4715 1.4621 1.2310 1.2429 1.2718 1.6169 1.0769 1.0542 1.0549 1.0638 1.0460 1.0681 1.0743 1.0554 1.0834 1.0589 1.0817 1.0374 1.0380 1.0387 1.0564 1.1036 1.1002 1.0991 1.0993 1.0987 1.1001 1.0991 1.0995 1.0662
irintensity: 1.5671 0.1714 0.4919 2.8956 7.8395 1.7059 2.9195 2.0709 3.3436 155.1028 2.2742 8.1201 1.1252 2.3173 1.8942 4.4453 3.1008 4.4714 4.6649 4.8269 11.5312 4.5772 25.1248 16.6451 2.4212 126.6983 82.7058 55.7046 2.0804 22.9653 7.5098 19.4233 10.2672 14.5874 12.4671 0.2654 2.4283 13.6318 5.5108 8.6113 9.8335 3.5899 20.6606 52.7759 1.6671 3.7950 0.8539 16.1129 6.4894 6.7380 13.8054 11.7958 11.5633 49.2229 38.4601 51.0216 22.1375 41.9550 18.7182 32.0427 66.8350 12.8669 30.1173 65.7261 35.9421 40.1146 28.6564 49.3597 3.6875
temp: 298.150 k
press: 1.00000 atm
elementType: 8 8 6 6 6 6 6 6 6 1 1 1 1 1 1 1 1 1 1 1 1 1 1 1 1
symmnumber: 1
zpe: 579056.3 jmol-1
zpe.correction: 0.220551 hartree
zpe.thermalcorrener: 0.232775 hartree
zpe.thermalcorrenthalpy: 0.233719 hartree
zpe.thermalcorrgfe: 0.182208 hartree
zpe.sumelectzpe: -425.995259 hartree
zpe.sumelectthermal: -425.983035 hartree
zpe.sumelectthermalent: -425.982091 hartree
zpe.sumelectthermalfe: -426.033602 hartree
dipole: -0.2744 0.7144 0.1206
dipole: 0.7748
quadrupole: -51.3298 -58.8675 -57.6791
quadrupole: 6.1027 -3.9261 -0.0647
quadrupole: 4.6290 -2.9087 -1.7203 6.1027 -3.9261 -0.0647
hfenergy: -426.2158104 hartree
pointgroup: C01 [X(C7H16O2)]
dipole: -0.1248071 0.2738591 0.048345 debye
dipolederiv: -1.2149198 -0.0949309 -0.0043012 -0.066059 -0.4941691 -0.0333436 0.0235207 0.0118127 -0.3909097 -0.7618795 0.262691 -0.1167843 0.2560143 -0.4699987 -0.1430462 -0.1279595 -0.1334659 -0.4790751 0.826308 0.1149097 -0.0637281 0.2099893 0.4334203 0.0308096 -0.2161382 -0.0003432 0.3766348 0.0135961 0.0196587 -0.0351827 0.0347546 0.0079073 -0.0031674 -0.0315359 0.0063379 0.120181 0.6340724 -0.0335373 0.0707658 -0.205534 0.255854 0.0699207 0.2461863 0.080479 0.3391105 0.6594646 -0.1302921 0.1009498 -0.1234435 0.4257917 0.044139 0.0551845 0.0506668 0.38995 -0.0549874 -0.0011914 -0.0023306 -0.0811257 -0.2307731 -0.0252351 0.031811 -0.0222632 0.0556497 0.0516666 0.0168433 -0.0007123 -0.0022107 -0.0792038 -0.0175951 -0.0303246 -0.0073291 0.0875331 -0.0450602 0.0227092 -0.0300968 0.0856902 -0.2179332 -0.0416711 -0.0002736 -0.0543249 0.0400675 -0.0472849 -0.0158606 -0.0535347 -0.0411818 -0.0057009 -0.058317 0.0450385 -0.0291795 -0.2304413 0.0975477 0.0068059 0.0198597 0.022776 0.0300053 -0.0480293 -0.0335741 -0.0374222 -0.160014 -0.1482986 -0.0928018 0.0467266 -0.0915469 -0.0116892 0.0306799 0.0822718 0.0343961 0.0598194 -0.0120365 0.0037632 -0.0162692 0.0779927 -0.1950151 -0.0237869 -0.0300752 -0.0450478 0.041385 -0.0195716 0.0095596 0.0381457 0.0272641 0.0520785 -0.04806 -0.0577987 -0.0080515 -0.1994375 -0.0127253 0.0273724 -0.0234363 0.0148023 -0.0033668 -0.0230671 -0.0394028 -0.016043 -0.2144233 0.1029637 -0.0083621 -0.0127538 0.0004405 0.0686458 0.0073883 -0.0342852 -0.0664773 -0.1382523 -0.0349654 0.1511172 -0.0671874 0.1140724 -0.0193895 0.0298388 -0.0745503 0.0380246 0.0573541 -0.1171967 -0.1010844 0.091727 -0.0776188 0.063153 0.0129972 0.0972473 0.0295977 0.0479208 -0.0643253 -0.1322846 0.0572432 -0.105909 0.0570531 0.0081117 0.0692932 0.0220184 0.061242 0.0949211 -0.0088781 -0.0007341 -0.0078219 0.0563169 0.0037756 0.0233651 -0.0599864 -0.1867092 -0.0753441 0.1454583 -0.0767558 0.1250796 -0.0472429 0.0428922 -0.0857564 0.0601944 0.0544428 -0.0913889 -0.1397096 0.0927493 -0.106103 -0.0107995 0.0398006 0.1036876 0.0536903 0.0364955 -0.0351646 0.1198909 -0.0522197 0.1235544 0.0718204 0.0117467 -0.0559823 0.017667 0.0795836 0.1015658 -0.0139945 -0.014161 0.0015876 0.0647501 0.0118621 -0.0302849 -0.0518136 -0.1465733 0.1530428 -0.1278519 0.0520207 -0.1854635 0.1984855 0.1213566 0.0703357 0.1268626 0.2984659 unknown
polarizability: 99.7746926|1.7787615|84.9407413|0.0992216|-1.0003617|69.4680466 unknown
InChI: InChI=1S/C7H16O2/c1-4-7(3)9-5-6(2)8/h6-8H,4-5H2,1-3H3
charge 0 multiplicity 1
25 atoms
O  -0.236301 -0.141707 -0.38094
O  3.369375 -0.487322 0.14662
C  -1.4755 -0.642268 0.255945
C  -2.611975 0.248304 -0.279788
C  0.99909 -0.628924 0.238126
C  2.152421 0.192076 -0.352458
C  -1.70224 -2.135878 -0.049564
C  -2.485313 1.724143 0.150012
C  2.109343 1.670312 0.060747
H  -1.383376 -0.497778 1.35881
H  -2.609861 0.174892 -1.384994
H  -3.576267 -0.169551 0.071139
H  1.172475 -1.700952 0.01436
H  0.965693 -0.497634 1.342486
H  2.099177 0.11204 -1.45934
H  -1.777427 -2.294298 -1.140591
H  -0.878848 -2.7638 0.335238
H  -2.639582 -2.487219 0.420545
H  -1.518754 2.137002 -0.186379
H  -2.536131 1.825473 1.251047
H  -3.295746 2.338132 -0.283562
H  2.913078 2.252009 -0.430388
H  1.139107 2.109583 -0.230681
H  2.22748 1.765894 1.15581
H  4.162382 0.032972 -0.137799
