program: Gaussian 09
title: 000040929
version: EM64L-G09RevD.01
frameworkgroup: C1[X(C22H17NO3)]
method: RPBEPBE
basis: SDD
operation: Freq
keyword: #p
keyword: freq=noraman
keyword: PBEPBE/SDD
title: #p freq=noraman PBEPBE/SDD
converged: YES YES NO NO
title: Mulliken charges:
elementType: O O O N C C C C C C C C C C C C C C C C C C C C C C H H H H H H H H H H H H H H H H H
charge: -0.437123 -0.467327 -0.247705 -0.435680 -0.476990 0.372477 0.098425 0.025734 0.196772 0.444786 0.393650 -0.557469 -0.325430 -0.422704 -0.365241 -0.386858 -0.394299 0.255138 0.093364 -0.342736 -0.232754 -0.241327 -0.247732 -0.253113 -0.245429 -0.250573 0.264156 0.338631 0.261240 0.240609 0.242189 0.238772 0.254635 0.258266 0.253150 0.225218 0.225455 0.224343 0.225241 0.226186 0.227397 0.356669 0.387986
chargesum: 0.00000
title: Mulliken charges with hydrogens summed into heavy atoms:
elementType: O O O N C C C C C C C C C C C C C C C C C C C C C C
charge: -0.080454 -0.079341 -0.247705 -0.097049 -0.212834 0.372477 0.098425 0.025734 0.196772 0.444786 0.393650 -0.296228 -0.084822 -0.180515 -0.126469 -0.132222 -0.136033 0.255138 0.093364 -0.089586 -0.007536 -0.015872 -0.023389 -0.027872 -0.019243 -0.023175
polarizability: 2.94127212e+02 -1.94954049e+01 2.66632342e+02 -1.39231933e+01 2.14061802e+01 2.12632668e+02
1716.lowfreq: -7.7024 -6.3124 -0.0006 -0.0001 0.0004 2.1378 16.1101 26.0916 39.2764
frequency: 15.9128 26.0734 39.2436 47.9369 57.8184 68.3194 71.8896 88.8996 129.8444 149.6157 162.8940 192.9333 221.8181 237.6788 260.8085 287.2916 306.9420 332.6731 348.7593 368.1208 395.6663 402.0885 404.1986 424.8010 429.6786 473.6626 494.8965 501.6586 536.7051 558.0636 584.7253 588.0726 603.6046 609.1812 613.8925 618.3964 641.5562 658.8328 668.1416 701.1161 705.5734 712.6158 735.8050 751.0711 754.5534 768.9431 810.3267 816.8481 839.9597 845.4571 852.1168 854.0461 860.9631 869.6174 924.0457 931.5441 942.1714 945.1552 976.9353 983.0430 990.3658 990.9075 994.4446 996.8454 1018.1098 1027.2264 1029.4107 1080.9605 1085.3431 1095.3183 1120.4496 1143.8212 1170.9536 1171.8046 1174.1178 1179.1668 1192.2873 1193.3423 1208.4103 1220.7387 1247.5508 1263.0332 1274.8510 1294.3115 1322.4428 1327.8390 1340.8925 1350.7604 1376.9013 1385.8432 1423.0756 1433.5777 1437.7679 1442.8636 1457.6478 1481.8276 1482.5937 1489.3416 1539.8071 1588.4768 1590.3746 1591.7665 1609.2757 1612.6744 1632.9933 1652.0923 2991.9484 3116.8755 3120.2311 3124.5121 3127.0097 3136.4978 3138.0301 3139.1893 3144.7582 3147.8413 3150.7279 3162.1135 3162.8592 3175.4989 3549.1226 3581.9067 3606.0615
redmass: 4.1574 5.9355 4.0262 5.4143 5.2509 5.7850 6.6393 8.8983 7.2655 5.4517 4.9490 6.3979 4.4832 4.5197 6.0834 4.8334 6.5600 5.5168 9.2358 1.1620 6.4218 2.8449 2.8292 4.7032 2.6978 3.5665 3.9663 6.4187 1.4649 5.6014 1.6496 2.5543 2.0223 4.9110 6.0353 6.2953 4.8840 5.6498 5.7722 2.7004 1.8266 2.2739 6.4070 2.5967 3.0412 2.5612 1.5405 3.7902 3.0257 2.3088 2.0134 1.5117 1.2914 4.1378 1.4739 1.7312 1.3322 3.6828 1.3940 1.3939 5.8980 5.1212 1.3736 1.3163 3.0241 2.3402 2.1810 1.6864 1.6097 2.5245 1.5124 1.4221 1.1196 1.0609 2.1099 1.6718 1.1244 1.1205 2.3477 1.7431 2.0760 1.6089 2.0103 1.7702 1.3530 2.3302 1.5692 2.1398 7.6975 5.1657 7.5385 2.6050 2.6474 2.1083 4.3550 2.2284 2.2321 4.8448 7.9313 6.0453 6.0886 5.9411 5.9638 6.0281 7.5729 8.2774 1.0819 1.0858 1.0843 1.0871 1.0877 1.0922 1.0927 1.0923 1.0894 1.0961 1.0947 1.1014 1.1008 1.0961 1.0646 1.0660 1.0809
irintensity: 0.1055 0.0836 0.0249 0.4431 0.2485 0.4346 0.0831 0.8235 1.1173 0.9716 0.4303 0.5004 1.0013 0.5698 0.5489 1.4882 10.3063 7.2976 1.0159 103.0470 13.6551 0.0695 0.0885 6.5234 10.4489 3.7313 8.0267 30.6940 114.2996 23.5828 98.7494 8.5835 4.6862 17.6537 1.5965 2.6611 26.9589 19.5233 27.9192 23.9792 39.2259 69.5321 6.1578 10.3388 11.5000 29.3118 45.2488 22.9736 2.8301 16.7134 18.5161 6.5505 2.8046 16.1449 3.2421 8.6257 0.5394 131.4595 0.4538 0.1150 0.2720 0.6475 0.0869 2.9316 192.6791 21.5567 13.2238 29.1176 18.0137 239.1703 138.1466 107.3302 0.7531 0.2030 13.1420 39.5984 2.1515 2.3874 1.0887 18.1320 20.5170 11.5483 16.7583 36.3940 1.8017 28.5705 20.5771 31.1460 2.0593 1.1248 46.5464 8.1238 21.7664 6.5864 7.1445 15.7217 34.8260 51.1783 120.5767 4.6370 9.5719 2.4011 15.7934 5.3167 125.0195 359.2130 6.5799 5.0993 1.4694 0.8178 2.3363 6.1264 21.9622 23.6902 6.3240 29.8290 25.2001 32.0944 19.7581 9.0846 71.0757 36.0922 123.6982
temp: 298.150 k
press: 1.00000 atm
elementType: 8 8 8 7 6 6 6 6 6 6 6 6 6 6 6 6 6 6 6 6 6 6 6 6 6 6 1 1 1 1 1 1 1 1 1 1 1 1 1 1 1 1 1
symmnumber: 1
zpe: 870372.9 jmol-1
zpe.correction: 0.331508 hartree
zpe.thermalcorrener: 0.353063 hartree
zpe.thermalcorrenthalpy: 0.354007 hartree
zpe.thermalcorrgfe: 0.278977 hartree
zpe.sumelectzpe: -1127.202649 hartree
zpe.sumelectthermal: -1127.181094 hartree
zpe.sumelectthermalent: -1127.180149 hartree
zpe.sumelectthermalfe: -1127.255179 hartree
dipole: -0.8862 -1.0016 0.0797
dipole: 1.3397
quadrupole: -151.1320 -126.3430 -147.5724
quadrupole: 4.1522 7.1458 4.8894
quadrupole: -9.4496 15.3395 -5.8899 4.1522 7.1458 4.8894
hfenergy: -1127.5341567 hartree
pointgroup: C01 [X(C22H17N1O3)]
dipole: -0.2188653 0.4782756 -0.0342466 debye
polarizability: 300.2849201|7.3949651|257.5424592|24.2470545|17.7202182|215.5648431 unknown
InChI: InChI=1S/C22H17NO3/c24-16-11-12-18-17(13-16)20(21(23-18)22(25)26)19(14-7-3-1-4-8-14)15-9-5-2-6-10-15/h1-13,19,23-25H
charge 0 multiplicity 1
43 atoms
O  -4.199066 -0.359635 -2.135139
O  1.50094 4.002486 1.7730
O  2.470809 1.899744 2.084325
N  -0.590801 3.045789 0.402329
C  0.863321 -0.41805 0.701183
C  0.017946 0.825626 0.460558
C  -1.234822 0.950454 -0.251394
C  0.380116 2.135309 0.850636
C  -1.586454 2.350666 -0.27249
C  1.87318 -0.637273 -0.438365
C  0.008249 -1.66124 1.030973
C  -2.102104 0.007516 -0.877977
C  -2.763791 2.820122 -0.903662
C  3.232999 -0.882581 -0.123277
C  -0.933815 -1.581876 2.091207
C  1.484573 -0.61881 -1.80307
C  0.156044 -2.895425 0.352412
C  -3.268994 0.484846 -1.495152
C  1.535661 2.592635 1.606989
C  -3.600274 1.876378 -1.515495
C  4.18404 -1.111686 -1.143609
C  -1.712538 -2.699451 2.457207
C  2.432542 -0.846496 -2.825183
C  -0.623707 -4.019136 0.716703
C  3.786426 -1.096858 -2.499952
C  -1.56259 -3.927053 1.768164
H  1.467916 -0.204193 1.604506
H  -0.533752 4.048242 0.572995
H  -1.869605 -1.063154 -0.853627
H  -3.021771 3.883978 -0.918048
H  3.5480 -0.878171 0.926696
H  -1.058821 -0.632429 2.62622
H  0.442258 -0.413329 -2.070582
H  0.88624 -2.984251 -0.458533
H  -4.525311 2.177144 -2.015917
H  5.231985 -1.29456 -0.88008
H  -2.43335 -2.615719 3.278598
H  2.116186 -0.825359 -3.874507
H  -0.490521 -4.966607 0.181672
H  4.521832 -1.271083 -3.293609
H  -2.164118 -4.797928 2.052289
H  -3.923971 -1.306453 -2.053262
H  2.303712 4.280871 2.287668
