program: Gaussian 09
title: 000005516
version: EM64L-G09RevD.01
frameworkgroup: C1[X(C26H28ClNO)]
method: RPBEPBE
basis: SDD
operation: Freq
keyword: #p
keyword: freq=noraman
keyword: PBEPBE/SDD
title: #p freq=noraman PBEPBE/SDD
converged: YES YES NO NO
title: Mulliken charges:
elementType: Cl O N C C C C C C C C C C C C C C C C C C C C C C C C C C H H H H H H H H H H H H H H H H H H H H H H H H H H H H
charge: -0.083313 -0.266286 -0.095422 0.096134 0.168724 0.287409 -0.532714 0.280743 0.307367 -0.403992 -0.371320 -0.601571 0.338936 -0.369584 -0.380208 -0.402697 -0.398547 -0.388136 -0.416013 -0.380312 -0.286503 -0.231216 -0.229858 -0.229366 -0.239989 -0.249682 -0.248073 -0.613703 -0.613032 0.277367 0.237553 0.231024 0.254902 0.289348 0.260261 0.252032 0.250139 0.251987 0.255732 0.255561 0.231542 0.224977 0.202408 0.224250 0.209522 0.224872 0.226090 0.227093 0.225687 0.227474 0.228857 0.222946 0.190984 0.228772 0.220888 0.193082 0.226874
chargesum: 0.00000
title: Mulliken charges with hydrogens summed into heavy atoms:
elementType: Cl O N C C C C C C C C C C C C C C C C C C C C C C C C C C
charge: -0.083313 -0.266286 -0.095422 0.096134 0.168724 0.287409 -0.017794 0.280743 0.307367 -0.172968 -0.116418 -0.051962 0.338936 -0.117552 -0.130069 -0.150710 -0.142816 -0.132575 -0.184471 0.047073 0.147270 -0.006344 -0.003768 -0.002273 -0.014302 -0.022208 -0.019216 0.028999 0.027812
polarizability: 4.49126283e+02 -7.72283755e+00 3.19879112e+02 3.35876766e+00 -9.71178703e+00 2.09689099e+02
1716.lowfreq: -2.9429 0.0007 0.0010 0.0017 1.2277 5.6753 15.5601 20.5853 28.7587
frequency: 15.5469 20.5020 28.7302 38.7614 43.3294 47.9760 54.7700 55.4075 58.6990 68.5597 72.0353 100.7589 105.7202 125.8669 138.7438 155.6278 177.7009 186.6759 197.8201 214.8323 217.1207 233.6753 237.5129 260.0167 289.5916 308.8037 316.1271 346.6709 364.1313 394.1638 403.4094 406.9979 416.4939 426.5650 441.7661 473.8995 501.5052 505.4817 525.9856 551.9383 594.6903 613.2481 614.7314 618.2283 627.7766 661.3566 669.6631 699.4478 703.8874 712.7298 736.1183 757.8253 769.3493 782.5863 783.7984 806.7493 814.9707 830.6875 841.2306 844.5164 852.6149 855.7160 903.8682 923.9529 928.5068 945.1314 970.2313 974.7730 977.5348 980.2306 984.4685 987.8996 989.8147 994.5843 995.6318 1002.9057 1020.5829 1027.8169 1033.7720 1035.0625 1046.6012 1057.7970 1063.7354 1082.5868 1087.1507 1090.5006 1095.7473 1116.5280 1133.4518 1138.9036 1168.1308 1171.5908 1172.2198 1177.1461 1184.3115 1190.9084 1192.8342 1229.3360 1245.6271 1248.7407 1259.7002 1267.9958 1274.9678 1287.0849 1294.2494 1305.2550 1313.8899 1321.9356 1325.2996 1332.5054 1356.5054 1369.0287 1373.5576 1391.1339 1418.9845 1422.1847 1431.2957 1432.8350 1443.3440 1454.3869 1461.9429 1467.2607 1469.3814 1471.6490 1476.4527 1477.7293 1480.5927 1483.3672 1485.6799 1497.4472 1566.3324 1571.5747 1579.6357 1589.5205 1605.5537 1606.5150 1616.6516 2855.2372 2864.7008 2891.3742 2970.3283 2992.9480 3021.7635 3027.7734 3032.6255 3057.3456 3057.8128 3080.4724 3085.1634 3087.4686 3120.6621 3121.9916 3127.8836 3129.4095 3136.0636 3140.2920 3140.5839 3142.0491 3142.6947 3151.0913 3151.2797 3164.5735 3164.9192 3165.0427 3168.6536
redmass: 5.4841 5.9984 5.0819 3.1408 5.5621 4.5828 4.0128 4.4427 4.3875 4.1877 4.0330 2.8831 2.7105 2.6280 3.6393 4.2430 5.2598 5.2547 2.4292 4.2307 1.1543 2.7718 2.1778 3.1765 4.5373 4.1578 3.4751 2.8085 3.6637 3.0112 2.8472 2.8517 3.0016 2.6532 3.6959 4.3474 3.7577 3.7297 3.4198 4.1353 4.5709 6.3457 6.0356 5.7363 6.5141 6.5743 4.6927 2.2621 1.6735 2.5155 3.0849 2.6425 1.5018 3.1333 2.4617 1.7423 1.6384 1.4265 2.8270 1.7479 1.2542 1.2497 3.9374 1.5042 1.4766 1.3744 1.3552 5.6087 1.3966 1.4317 2.3798 5.4404 4.8216 1.3291 1.3210 2.5205 2.8206 2.2181 2.1964 1.5571 2.8158 2.5043 1.6131 1.6087 1.7077 1.5422 1.9579 1.3451 1.2732 1.4465 1.4248 1.0538 1.0860 1.4249 2.1496 1.1225 1.1264 2.9319 1.3034 1.8219 2.3824 2.5250 1.3616 2.3393 1.1982 1.4484 1.3978 1.5486 1.3268 1.3847 4.4821 6.2974 6.0584 1.4361 3.9028 1.1448 2.3234 2.2869 1.1627 1.0932 1.0488 1.0675 1.1529 1.1127 1.0575 2.0429 2.1851 1.1285 1.0688 2.2315 7.1750 6.6180 5.8414 7.5510 6.0574 6.0479 6.3905 1.0566 1.0579 1.0687 1.0559 1.0661 1.0732 1.0752 1.0968 1.0980 1.0568 1.1009 1.1006 1.0936 1.0849 1.0845 1.0870 1.0876 1.0885 1.0884 1.0922 1.0926 1.1102 1.0957 1.0961 1.1013 1.1014 1.0947 1.0960
irintensity: 0.4109 0.1806 0.3605 0.1926 0.4683 0.1270 0.4958 0.2449 0.4366 0.0718 0.0888 0.2804 1.1239 2.6749 2.6383 0.4438 0.1923 2.4364 0.3811 0.7605 1.1787 6.2562 0.3979 1.5397 0.9567 2.3524 1.2377 9.9814 3.1316 1.2602 0.2509 0.0145 0.8777 0.8703 2.8797 1.2296 9.8693 2.9393 25.4946 10.1806 41.2870 1.1039 3.6377 3.0199 7.8955 21.4729 3.5314 51.6309 61.1767 2.6199 1.8193 11.2286 53.2031 35.5834 39.1064 19.6791 3.0552 2.8225 5.7898 47.2722 0.0864 0.7208 5.9437 7.9158 4.9516 0.5205 0.8494 117.1123 0.8118 1.1253 8.8998 0.2412 2.0871 0.5559 0.3245 4.1376 13.4869 11.7959 64.9783 22.2312 2.6482 4.4066 6.0848 0.1488 14.9948 17.8072 6.1079 14.9273 6.5904 3.0210 22.6696 0.0348 2.5408 114.3691 22.2032 0.4629 0.1273 299.6910 5.1291 7.9109 22.3467 20.3569 26.2975 3.2998 2.1476 0.3529 0.4616 2.3265 13.4804 2.0809 29.0510 3.7097 0.3437 1.7625 8.0487 3.7529 1.0069 15.3606 5.4623 7.6077 9.5227 5.1718 17.3864 43.6359 10.5856 6.3208 10.0472 64.4446 9.5422 121.4023 9.2672 5.7977 2.8148 16.4048 12.2178 11.2657 120.0980 67.6929 176.3567 112.4179 33.2497 11.3882 39.0323 48.6745 9.1721 37.0711 17.0435 31.0238 60.7542 5.1296 5.7964 2.1251 0.3597 1.5942 16.5329 14.0591 18.8256 19.8092 12.5352 33.1576 34.8165 28.1403 24.4187 12.0191 6.2534
temp: 298.150 k
press: 1.00000 atm
elementType: 17 8 7 6 6 6 6 6 6 6 6 6 6 6 6 6 6 6 6 6 6 6 6 6 6 6 6 6 6 1 1 1 1 1 1 1 1 1 1 1 1 1 1 1 1 1 1 1 1 1 1 1 1 1 1 1 1
symmnumber: 1
zpe: 1228972.1 jmol-1
zpe.correction: 0.468091 hartree
zpe.thermalcorrener: 0.496446 hartree
zpe.thermalcorrenthalpy: 0.497390 hartree
zpe.thermalcorrgfe: 0.405105 hartree
zpe.sumelectzpe: -1595.467967 hartree
zpe.sumelectthermal: -1595.439611 hartree
zpe.sumelectthermalent: -1595.438667 hartree
zpe.sumelectthermalfe: -1595.530953 hartree
dipole: 0.9756 -1.8485 0.6677
dipole: 2.1942
quadrupole: -142.6956 -188.2808 -175.8630
quadrupole: 3.8123 1.6703 -1.6198
quadrupole: 26.2509 -19.3344 -6.9165 3.8123 1.6703 -1.6198
hfenergy: -1595.9360573 hartree
pointgroup: C01 [X(C26H28Cl1N1O1)]
dipole: 0.3564429 -0.7289004 0.2947994 debye
polarizability: 448.2568098|-10.6685531|319.6851207|9.9909803|-13.4239478|210.7525635 unknown
InChI: InChI=1S/C26H28ClNO/c1-28(2)19-20-29-24-15-13-23(14-16-24)26(22-11-7-4-8-12-22)25(17-18-27)21-9-5-3-6-10-21/h3-16H,17-20H2,1-2H3
charge 0 multiplicity 1
57 atoms
Cl -0.414355 4.982528 -0.364758
O  4.348642 -0.848655 -0.444965
N  7.686431 0.316614 0.759759
C  -1.358921 -0.161065 -0.235945
C  -1.998106 1.06182 -0.373879
C  0.132816 -0.300631 -0.266464
C  -1.251891 2.325394 -0.811653
C  -2.111939 -1.455181 -0.104717
C  -3.463293 1.250569 -0.113917
C  0.981912 0.491772 0.549365
C  0.748869 -1.281968 -1.098097
C  -1.259471 3.408539 0.27655
C  2.972367 -0.617376 -0.329858
C  2.385965 0.345596 0.52887
C  2.143692 -1.435031 -1.140836
C  -1.69286 -2.435078 0.837746
C  -3.214559 -1.762697 -0.94891
C  -4.064213 0.727618 1.066909
C  -4.282149 2.010774 -0.995921
C  6.681112 -0.477745 0.016812
C  5.258763 -0.017747 0.364977
C  -2.373244 -3.666006 0.956896
C  -3.888696 -2.996889 -0.838854
C  -5.429981 0.940526 1.345155
C  -5.651992 2.218138 -0.723002
C  -3.476463 -3.952963 0.119405
C  -6.234455 1.684292 0.449634
C  8.944078 -0.421634 0.994835
C  7.935266 1.645579 0.162082
H  -0.214456 2.090531 -1.095729
H  -1.744512 2.747216 -1.709566
H  0.536473 1.219847 1.236402
H  0.118464 -1.922852 -1.723899
H  -2.275568 3.7220 0.556051
H  -0.686186 3.121022 1.170535
H  3.000952 0.970355 1.182818
H  2.615405 -2.177955 -1.791224
H  -0.83037 -2.224036 1.480194
H  -3.534524 -1.030372 -1.697436
H  -3.448354 0.153881 1.767415
H  -3.85371 2.427871 -1.914772
H  6.779104 -1.538867 0.307921
H  6.821495 -0.42773 -1.09068
H  5.065656 -0.169854 1.444596
H  5.101878 1.051589 0.11846
H  -2.040464 -4.401925 1.69774
H  -4.732966 -3.215046 -1.502629
H  -5.866576 0.529337 2.262361
H  -6.263264 2.796485 -1.42514
H  -4.001916 -4.910751 0.205874
H  -7.29597 1.849638 0.664985
H  9.611385 0.182324 1.635835
H  9.501176 -0.665351 0.054892
H  8.730142 -1.367468 1.522901
H  6.99238 2.210958 0.065985
H  8.405746 1.587365 -0.852488
H  8.607154 2.226095 0.818977
