program: Gaussian 09
title: 000040930
version: EM64L-G09RevD.01
frameworkgroup: C1[X(C23H19NO3)]
method: RPBEPBE
basis: SDD
operation: Freq
keyword: #p
keyword: freq=noraman
keyword: PBEPBE/SDD
title: #p freq=noraman PBEPBE/SDD
converged: YES YES NO NO
title: Mulliken charges:
elementType: O O O N C C C C C C C C C C C C C C C C C C C C C C C H H H H H H H H H H H H H H H H H H H
charge: -0.277141 -0.446297 -0.262731 -0.408864 -0.406975 0.366266 0.099815 0.301667 0.461398 0.216822 -0.411061 -0.498864 0.157283 -0.356442 -0.339499 -0.426982 -0.384432 0.265692 -0.360694 -0.374015 -0.263870 -0.239030 -0.247295 -0.240982 -0.247386 0.060216 -0.533797 0.244136 0.286476 0.307262 0.286795 0.253851 0.233520 0.234473 0.257325 0.269317 0.236833 0.225589 0.223070 0.223028 0.223067 0.225552 0.220251 0.243934 0.222359 0.380360
chargesum: 0.00000
title: Mulliken charges with hydrogens summed into heavy atoms:
elementType: O O O N C C C C C C C C C C C C C C C C C C C C C C C
charge: -0.277141 -0.065937 -0.262731 -0.101602 -0.162839 0.366266 0.099815 0.301667 0.461398 0.216822 -0.124586 -0.212068 0.157283 -0.102591 -0.105979 -0.192509 -0.127107 0.265692 -0.091377 -0.137182 -0.038281 -0.015960 -0.024266 -0.017915 -0.021834 0.060216 0.152746
polarizability: 3.20747871e+02 -2.80318227e+01 2.67244523e+02 -5.21435908e+00 -9.67111120e+00 2.11791766e+02
1716.lowfreq: -6.1688 -0.0005 0.0005 0.0006 5.3652 6.4286 15.3494 21.9021 34.3325
frequency: 15.1055 21.8274 34.2899 42.9424 51.6129 57.1946 73.8432 99.7295 106.5907 108.2804 150.9800 164.6493 179.3662 211.0501 229.8959 238.0312 263.2039 272.2671 287.8577 303.4326 332.1619 353.9623 405.8240 423.9518 429.5831 455.0997 472.4629 491.5666 502.7435 534.2300 536.7658 548.2003 556.0178 573.0210 593.6331 602.9765 610.9633 618.0567 634.9065 643.0327 704.2042 716.7410 724.9925 733.4994 745.9398 758.9769 759.6403 772.9731 782.5580 806.7791 825.3654 832.1004 843.1450 856.1269 860.3633 862.3759 904.7613 931.2924 934.5946 944.1111 971.3196 978.2776 979.6950 989.8355 990.7604 993.6576 1006.6510 1026.3379 1041.8302 1044.0965 1081.1391 1094.4625 1096.8148 1112.2968 1140.7844 1146.8593 1147.2848 1170.2422 1171.8869 1179.0790 1189.4127 1198.2717 1220.9859 1226.6912 1247.4499 1263.0942 1267.0698 1286.1618 1295.5117 1314.0698 1329.0979 1337.6767 1380.8183 1391.0241 1392.7274 1428.7723 1432.1693 1439.9195 1444.3126 1463.1327 1466.5888 1468.6507 1474.3083 1482.2162 1484.6718 1558.8711 1588.5203 1592.9835 1594.6064 1605.2798 1611.6382 1627.4154 1637.0926 2959.7491 2985.5114 3048.3022 3116.1557 3122.1609 3124.4595 3126.2727 3134.6390 3135.5784 3138.7423 3144.2094 3153.7683 3160.2946 3165.9310 3167.2159 3171.7346 3231.6887 3531.6993 3610.2679
redmass: 6.2586 4.3934 3.8860 6.0429 5.9922 5.7631 6.4217 3.5963 5.5205 5.1143 4.8820 3.3139 4.8175 4.6160 1.8210 2.7213 3.8312 4.7815 3.7424 3.9266 8.3821 6.2048 2.8286 3.0547 5.6019 3.9320 4.8941 3.9657 4.4195 1.7306 2.8113 2.0971 2.5042 5.6970 2.6064 2.4830 4.9262 6.1987 4.1079 4.6649 2.2405 2.5501 4.3245 3.2575 4.6681 1.4520 4.1638 2.8089 4.1954 2.0481 2.2288 1.5668 3.1120 1.3549 1.7227 3.0745 4.3723 1.6120 1.5121 1.3768 1.3347 1.3548 1.3528 7.8663 5.4920 1.3671 3.4691 2.4150 2.7790 2.1477 1.6340 1.5990 2.3518 1.2610 1.6023 1.4358 1.4159 1.0624 1.1009 1.7274 1.1219 2.1987 2.8693 2.2427 1.8163 1.5136 1.6128 1.9391 1.5323 2.0695 2.9576 1.3438 7.6606 5.2457 5.5181 1.4600 2.5025 2.1052 1.7032 5.4037 1.0510 1.2561 4.7954 2.2712 1.8735 6.3302 5.9388 6.0380 6.9305 6.2860 6.1163 7.1325 8.3292 1.0328 1.0818 1.1039 1.0852 1.0869 1.0986 1.0859 1.0916 1.0900 1.0889 1.0959 1.0935 1.1015 1.0956 1.0995 1.0932 1.0987 1.0640 1.0809
irintensity: 0.3961 0.5174 0.0491 0.1097 0.0330 0.5328 2.2766 6.2045 2.4041 0.4252 0.2900 0.8621 1.6681 3.0905 1.0009 1.4985 0.1590 0.2578 2.4035 0.1687 4.1322 0.2739 0.1540 16.9260 2.1205 1.9941 6.7043 8.1601 18.2096 25.0073 12.0098 55.2662 89.1404 14.6796 8.1814 40.2726 21.6180 3.9139 12.0230 5.3701 21.2562 60.9871 26.0658 37.8135 17.3326 80.4020 2.5070 13.6204 4.2482 24.3443 6.2095 23.0411 6.1026 1.1000 2.4956 2.3739 13.5192 4.8338 13.2737 1.2161 0.6272 0.0647 0.2816 31.0456 5.9187 0.0353 218.7461 11.7456 7.9819 12.4739 11.3940 78.3870 21.8319 0.1469 76.0528 6.3275 30.1249 0.1511 10.5038 0.4715 1.3108 8.6785 114.2079 30.8036 8.6440 1.7201 6.8333 7.0242 0.7990 16.5033 107.3062 4.0179 5.7417 16.3589 52.3371 19.2168 14.8525 6.9760 9.6790 8.2285 11.7497 76.0557 27.8268 31.5697 20.0108 5.5796 26.1056 0.1508 8.0706 24.2390 20.3456 16.2105 435.4907 70.8561 4.1015 41.1717 5.2568 0.3117 19.0128 1.1715 16.9760 12.0283 9.4355 34.5925 24.7540 32.7086 8.1363 22.8940 0.4954 0.0607 40.1993 71.1575
temp: 298.150 k
press: 1.00000 atm
elementType: 8 8 8 7 6 6 6 6 6 6 6 6 6 6 6 6 6 6 6 6 6 6 6 6 6 6 6 1 1 1 1 1 1 1 1 1 1 1 1 1 1 1 1 1 1 1
symmnumber: 1
zpe: 944240.9 jmol-1
zpe.correction: 0.359642 hartree
zpe.thermalcorrener: 0.382614 hartree
zpe.thermalcorrenthalpy: 0.383558 hartree
zpe.thermalcorrgfe: 0.304833 hartree
zpe.sumelectzpe: -1166.413357 hartree
zpe.sumelectthermal: -1166.390385 hartree
zpe.sumelectthermalent: -1166.389441 hartree
zpe.sumelectthermalfe: -1166.468166 hartree
dipole: 3.8274 -0.7686 0.5250
dipole: 3.9390
quadrupole: -175.1109 -122.0998 -146.7264
quadrupole: 5.8379 -5.2661 -11.2900
quadrupole: -27.1319 25.8792 1.2526 5.8379 -5.2661 -11.2900
hfenergy: -1166.772999 hartree
pointgroup: C01 [X(C23H19N1O3)]
dipole: -1.5293915 -0.2464666 -0.04287 debye
polarizability: 319.2301926|30.3351451|261.5218269|-14.4426441|14.7191645|219.0321406 unknown
InChI: InChI=1S/C23H19NO3/c1-27-21-10-6-5-9-17(21)22(15-7-3-2-4-8-15)19-14-24-20-12-11-16(23(25)26)13-18(19)20/h2-14,22,24-25H,1H3
charge 0 multiplicity 1
46 atoms
O  -1.445361 1.927969 1.925896
O  4.334104 1.66139 1.029224
O  6.122342 0.541604 0.064876
N  0.937077 -2.981597 -1.587982
C  -0.821124 -0.290466 0.379691
C  0.111834 -1.231253 -0.365117
C  1.559942 -1.101045 -0.459456
C  -0.891005 1.107773 -0.251474
C  -2.216804 -0.916607 0.562423
C  2.047312 -2.21736 -1.232397
C  -0.225944 -2.387051 -1.063882
C  2.483361 -0.155249 0.040444
C  -1.234882 2.224541 0.566868
C  -0.657135 1.339835 -1.62346
C  3.421736 -2.404037 -1.511574
C  -2.479109 -1.721219 1.699695
C  -3.239557 -0.755362 -0.404826
C  3.8601 -0.338077 -0.230713
C  4.320157 -1.454685 -1.002555
C  -1.341278 3.525226 0.020672
C  -0.762597 2.634098 -2.185623
C  -3.731825 -2.350834 1.869924
C  -4.495309 -1.384415 -0.239333
C  -1.106737 3.724058 -1.359743
C  -4.746724 -2.185709 0.897843
C  4.882317 0.610771 0.265797
C  -1.793733 3.032294 2.820872
H  -0.408215 -0.151774 1.399316
H  -1.205241 -2.836471 -1.212863
H  0.960741 -3.8426 -2.129684
H  2.156623 0.711376 0.621682
H  -0.373652 0.489788 -2.254567
H  3.778883 -3.255497 -2.100683
H  -1.695404 -1.849532 2.45667
H  -3.058726 -0.122152 -1.280698
H  5.395907 -1.544494 -1.183983
H  -1.601844 4.379991 0.652007
H  -0.571854 2.786754 -3.253028
H  -3.918452 -2.964347 2.758917
H  -5.277345 -1.244265 -0.994696
H  -1.188956 4.732731 -1.780089
H  -5.72134 -2.669546 1.029148
H  -0.991288 3.795073 2.850804
H  -1.906724 2.572178 3.813506
H  -2.747399 3.507315 2.51968
H  5.079033 2.253279 1.318371
