program: Gaussian 09
title: 000040976
version: EM64L-G09RevD.01
frameworkgroup: C1[X(C22H28O2)]
method: RPBEPBE
basis: SDD
operation: Freq
keyword: #pfreq=noraman
keyword: PBEPBE/SDD
title: #p freq=noraman PBEPBE/SDD
converged: YES YES NO NO
title: Mulliken charges:
elementType: O O C C C C C C C C C C C C C C C C C C C C C C H H H H H H H H H H H H H H H H H H H H H H H H H H H H
charge: -0.436153 -0.234864 0.285601 -0.178405 -0.141482 -0.357906 0.111677 -0.505368 -0.767270 -0.587657 -0.247608 0.700846 -0.474563 -0.412638 -0.632081 0.553437 -0.448029 -0.726901 0.296784 -0.838515 -0.537018 -0.579596 0.180425 -0.568686 0.179980 0.238523 0.236577 0.227933 0.218806 0.229898 0.250538 0.249922 0.245867 0.230415 0.216466 0.207540 0.187686 0.216573 0.242246 0.243498 0.239735 0.202954 0.261464 0.207502 0.208121 0.328088 0.231040 0.230428 0.223451 0.246981 0.256580 0.287161
chargesum: 0.00000
title: Mulliken charges with hydrogens summed into heavy atoms:
elementType: O O C C C C C C C C C C C C C C C C C C C C C C
charge: -0.108065 -0.234864 0.285601 0.001575 0.097041 -0.121330 0.111677 -0.058630 -0.286834 -0.091868 -0.017194 0.700846 -0.050557 -0.008378 -0.146337 0.553437 -0.005340 -0.049814 0.296784 -0.377047 -0.066586 -0.323017 0.180425 -0.281525
polarizability: 2.88409225e+02 -8.32396679e+00 2.22581123e+02 -1.43227824e-01 7.55569394e+00 1.89806886e+02
1716.lowfreq: -11.8471 0.0006 0.0006 0.0007 6.8074 11.2896 29.4550 50.2878 55.3056
frequency: 29.3202 50.1554 55.2176 68.5879 98.9259 117.8707 118.1540 125.4563 142.2373 163.9869 172.8046 185.6419 201.0102 202.6741 223.7963 232.7140 239.2230 267.3583 298.7653 304.0462 326.0143 338.7218 363.1672 379.4518 389.1253 397.9374 413.6677 433.2341 462.0282 484.6259 494.2088 504.4299 509.2373 529.1291 543.1980 577.7583 587.0963 611.5329 622.1272 634.2578 652.0287 669.7186 696.8159 724.7444 731.3785 761.6949 768.4832 804.7880 810.6071 816.7682 838.1557 849.9701 865.6898 888.3754 903.5287 917.2116 930.3535 942.2088 948.7400 970.8957 971.9417 983.0104 991.5852 998.7579 1002.0954 1014.4856 1027.6538 1029.9968 1043.6284 1054.7828 1065.1989 1080.5050 1099.0077 1106.8697 1118.0879 1127.1664 1141.9716 1144.3737 1169.5380 1179.9330 1186.2966 1202.2298 1212.8522 1216.3785 1223.5872 1236.3544 1252.9741 1265.9399 1269.8060 1283.1613 1286.9786 1287.1856 1292.3696 1301.4228 1303.2366 1312.2359 1318.5060 1321.9890 1331.2767 1332.5370 1339.3642 1341.8550 1348.8757 1352.5643 1362.4301 1371.3211 1391.6205 1435.8267 1441.2621 1456.5574 1460.1293 1463.2436 1465.0652 1469.8129 1470.3344 1477.4954 1487.9332 1492.8674 1585.7445 1623.9007 1659.9254 2145.0125 2908.5031 2936.3085 2955.5083 2966.8989 2968.8435 2969.1456 2978.4670 2980.1809 2981.3543 2982.7519 2985.7695 3013.0838 3026.8560 3027.9762 3031.0235 3042.4769 3057.5494 3058.2923 3066.3238 3067.1780 3070.9712 3081.7180 3090.2051 3099.7963 3119.9375 3183.0619 3430.4597 3532.5599
redmass: 6.5178 4.2667 3.1981 2.7105 3.5887 3.1748 3.2968 3.7855 3.3088 2.5846 3.9295 3.1219 2.8840 1.1169 1.4751 3.0385 2.2646 2.5569 2.4900 2.9988 3.3069 2.9153 3.5444 3.3936 4.4997 3.5023 3.1448 3.5599 3.4918 3.3446 2.9480 3.4278 3.5958 2.7975 3.5561 3.1833 6.0665 3.6248 2.9614 1.3688 4.0952 1.2578 1.4238 1.7920 2.0654 2.1904 1.6151 1.9708 2.5977 2.7165 2.1590 2.5774 2.1303 2.2305 1.5929 2.4281 2.4341 1.8014 1.7141 1.9773 2.9104 1.7759 1.9154 2.5659 2.4361 2.2318 2.2866 3.0016 1.8977 2.8161 2.2498 1.9373 2.0071 2.1217 1.7859 1.6161 1.4429 2.3010 1.8914 1.5569 1.8991 1.3509 1.5360 1.5218 1.4150 1.2968 1.3607 1.5545 1.3276 1.6552 1.2827 1.6159 1.3607 1.9103 1.4212 1.3540 1.5596 1.3834 1.4862 1.6546 1.6107 1.5143 1.6520 1.7023 1.4174 1.3359 1.2029 1.1724 1.0835 1.0876 1.0730 1.0901 1.0863 1.0860 1.0768 1.0499 1.0545 1.0810 9.9985 7.6817 5.3647 6.0570 1.0819 1.0781 1.0798 1.0737 1.0672 1.0698 1.0625 1.0614 1.0638 1.0694 1.0377 1.0608 1.0987 1.0634 1.0980 1.0998 1.0969 1.0933 1.1016 1.0947 1.0986 1.0625 1.1027 1.1000 1.0913 1.1137 1.1596 1.0656
irintensity: 3.1661 2.4841 0.4706 0.1012 0.1659 0.4927 1.0329 0.2067 0.0438 4.3364 3.2829 1.7110 0.8633 126.3625 1.3680 0.5496 2.8270 1.3748 0.3756 1.3868 1.7905 0.3810 6.8088 0.1291 4.4519 2.1634 3.5939 1.8581 3.4390 1.1304 5.9563 4.3188 1.8903 0.7390 2.4198 10.0058 1.3743 2.3484 2.4494 70.7873 0.6584 54.9339 4.4711 4.8831 12.2970 4.7089 11.9168 8.9283 3.0440 3.7860 3.5926 11.6554 13.4542 6.6077 14.3176 6.9353 18.5692 17.4832 75.7981 8.6746 10.5875 0.1747 11.5492 7.0143 3.7710 5.9517 33.5451 3.7778 8.7102 3.0108 10.2169 4.4161 8.4421 6.8666 3.7895 9.5371 12.7316 7.3212 15.2266 2.6931 9.2112 7.1850 6.2075 22.1019 1.5400 1.8475 9.0702 49.5196 9.3674 8.7886 2.7918 5.0853 7.8201 8.4915 4.9070 14.0882 12.4862 4.4985 17.4440 12.0808 5.1344 10.4393 0.2004 8.9711 1.5775 8.0520 14.0582 7.6421 13.9221 22.9722 3.6741 9.9905 11.6433 8.8615 6.4690 7.5318 9.7571 13.0571 171.5374 202.1773 24.2731 1.4401 43.4555 4.8344 25.3793 7.6458 29.5021 9.4819 8.2354 22.9625 43.8975 84.1147 25.0210 40.3124 29.1512 33.0828 21.4467 36.5208 23.5829 22.0675 8.3569 17.4991 46.8243 7.7548 33.5295 24.6783 10.2079 20.8625 68.8202 6.8142
temp: 298.150 k
press: 1.00000 atm
elementType: 8 8 6 6 6 6 6 6 6 6 6 6 6 6 6 6 6 6 6 6 6 6 6 6 1 1 1 1 1 1 1 1 1 1 1 1 1 1 1 1 1 1 1 1 1 1 1 1 1 1 1 1
symmnumber: 1
zpe: 1162981.4 jmol-1
zpe.correction: 0.442956 hartree
zpe.thermalcorrener: 0.465836 hartree
zpe.thermalcorrenthalpy: 0.466780 hartree
zpe.thermalcorrgfe: 0.392645 hartree
zpe.sumelectzpe: -1003.686002 hartree
zpe.sumelectthermal: -1003.663122 hartree
zpe.sumelectthermalent: -1003.662178 hartree
zpe.sumelectthermalfe: -1003.736313 hartree
dipole: -3.0549 -1.2033 -1.2814
dipole: 3.5245
quadrupole: -201.5616 -133.4987 -140.4560
quadrupole: -4.5118 -5.8513 4.5378
quadrupole: -43.0562 25.0068 18.0494 -4.5118 -5.8513 4.5378
hfenergy: -1004.1289581 hartree
pointgroup: C01 [X(C22H28O2)]
dipole: 1.1913518 -0.4611446 0.5393104 debye
polarizability: 288.3117102|8.7272728|222.3849343|2.0131258|-7.8840005|190.1005892 unknown
InChI: InChI=1S/C22H28O2/c1-4-21-13-14(3)20-17-9-7-16(23)12-15(17)6-8-18(20)19(21)10-11-22(21,24)5-2/h2,12,17-20,24H,3-4,6-11,13H2,1H3
charge 0 multiplicity 1
52 atoms
O  4.158383 -1.429624 -0.146643
O  -6.068636 0.256348 -1.018331
C  2.12196 -0.002638 0.335191
C  1.133742 -1.200352 0.580608
C  -0.091234 -0.803866 1.458741
C  -0.839265 0.498618 1.014345
C  3.088841 -0.599861 -0.775042
C  0.884796 -1.811051 -0.831596
C  1.303339 1.200858 -0.241207
C  2.169028 -1.514416 -1.660209
C  -1.884455 0.30985 -0.152861
C  0.173034 1.597878 0.696056
C  -1.10163 -1.950986 1.718889
C  2.863236 0.402974 1.641251
C  -2.111227 -2.18126 0.566673
C  -2.779529 -0.906892 0.085344
C  -2.721457 1.602114 -0.335195
C  4.009012 1.426534 1.494275
C  3.805813 0.399143 -1.581688
C  0.096271 2.837113 1.247395
C  -3.91576 1.401135 -1.289745
C  -4.128155 -0.877155 -0.169349
C  -4.815117 0.259267 -0.817847
C  4.378576 1.216243 -2.301792
H  1.682611 -1.966416 1.177666
H  0.34545 -0.554996 2.448806
H  -1.43938 0.823376 1.89077
H  0.013647 -1.346507 -1.320838
H  0.675542 -2.894098 -0.769903
H  0.891145 0.914739 -1.231064
H  1.973137 2.058538 -0.422989
H  2.739907 -2.422743 -1.920205
H  1.922743 -1.009876 -2.609694
H  -1.32447 0.13066 -1.097391
H  -1.673629 -1.706008 2.63617
H  -0.557567 -2.893398 1.9277
H  3.272478 -0.511837 2.113721
H  2.110927 0.810277 2.343857
H  -2.879707 -2.912507 0.878292
H  -1.581439 -2.638423 -0.292648
H  -2.072754 2.418428 -0.697957
H  -3.103455 1.91784 0.657421
H  4.822311 1.022934 0.869466
H  3.665028 2.374323 1.042219
H  4.427234 1.667057 2.489047
H  3.717047 -2.138228 0.390656
H  -0.710187 3.113643 1.937428
H  0.840093 3.611523 1.024272
H  -3.550413 1.144576 -2.306749
H  -4.523887 2.317171 -1.388103
H  -4.756192 -1.750558 0.050645
H  4.889917 1.932336 -2.917856
