program: Gaussian 09
title: 000005333
version: EM64L-G09RevD.01
frameworkgroup: C1[X(C6H8N2O2S)]
method: RPBEPBE
basis: SDD
operation: Freq
keyword: #p
keyword: freq=noraman
keyword: PBEPBE/SDD
title: #p freq=noraman PBEPBE/SDD
converged: NO NO NO NO
title: Mulliken charges:
elementType: S O O N N C C C C C C H H H H H H H H
charge: 0.943990 -0.549480 -0.549483 -0.717257 -0.687282 -0.075915 -0.205756 -0.205750 0.512620 -0.385804 -0.385802 0.277752 0.277747 0.230209 0.230210 0.330459 0.330457 0.314543 0.314542
chargesum: 0.00000
title: Mulliken charges with hydrogens summed into heavy atoms:
elementType: S O O N N C C C C C C
charge: 0.943990 -0.549480 -0.549483 -0.056341 -0.058197 -0.075915 0.071996 0.071997 0.512620 -0.155595 -0.155592
polarizability: 1.64583567e+02 1.20121203e-05 1.09400869e+02 -2.05583718e+00 1.85431989e-04 6.46737746e+01
1716.lowfreq: -13.3012 -0.0020 0.0015 0.0020 1.1761 3.5758 17.3049 83.6007 106.3488
frequency: 15.5359 83.5910 106.3138 135.2056 175.9849 238.4043 267.7471 284.3728 322.6461 364.7677 403.9790 405.4950 414.1842 418.4475 425.2372 476.7561 529.1349 601.8588 622.7157 726.8601 789.8405 801.9931 816.4815 819.9048 836.6888 900.0101 956.6105 966.1482 983.1795 1020.1824 1054.0416 1070.4983 1131.1324 1182.5512 1297.4614 1321.5734 1399.3172 1435.3926 1490.3474 1536.0724 1587.0853 1615.6953 1648.3261 3133.2325 3135.1253 3160.9960 3163.7910 3355.2217 3521.4134 3563.1070 3702.1672
redmass: 3.3203 5.0475 1.5337 6.8616 5.1094 9.1191 2.5836 8.0101 4.6063 5.5918 1.1885 2.1645 2.9565 9.5383 1.2984 4.1165 2.7671 5.7757 6.9090 2.9019 6.8332 2.5432 1.2563 2.5338 1.8715 4.3548 1.3705 1.3551 4.7259 1.4198 2.5506 1.4498 1.1945 1.1177 1.2995 2.6410 5.6013 3.7662 2.9646 1.0859 7.3551 4.6592 1.2368 1.0891 1.0889 1.0954 1.0967 1.0415 1.0995 1.0452 1.1040
irintensity: 2.9339 3.4091 39.4196 0.3579 0.0430 8.9451 5.2187 9.1435 1.7380 15.6158 0.1770 0.6130 0.0459 93.1457 256.4433 188.8439 74.3980 19.9267 0.4148 0.4624 38.0694 40.1225 0.4139 186.1292 84.9990 64.2054 0.1072 0.1360 6.3557 0.0281 58.9822 26.7743 11.1016 32.5770 4.3968 68.1128 5.2332 1.6256 70.7185 16.1477 8.1244 144.9710 260.3637 12.9829 11.8211 1.2819 11.6958 22.0134 21.2114 103.2388 25.7094
temp: 298.150 k
press: 1.00000 atm
elementType: 16 8 8 7 7 6 6 6 6 6 6 1 1 1 1 1 1 1 1
symmnumber: 1
zpe: 361360.9 jmol-1
zpe.correction: 0.137635 hartree
zpe.thermalcorrener: 0.149354 hartree
zpe.thermalcorrenthalpy: 0.150298 hartree
zpe.thermalcorrgfe: 0.099071 hartree
zpe.sumelectzpe: -890.455057 hartree
zpe.sumelectthermal: -890.443338 hartree
zpe.sumelectthermalent: -890.442394 hartree
zpe.sumelectthermalfe: -890.493621 hartree
dipole: 6.3029 -0.0002 2.9660
dipole: 6.9659
quadrupole: -51.0681 -69.2602 -79.2595
quadrupole: 0.0004 -10.8651 -0.0001
quadrupole: 15.4612 -2.7309 -12.7302 0.0004 -10.8651 -0.0001
hfenergy: -890.5926919 hartree
pointgroup: C01 [X(C6H8N2O2S1)]
dipole: -2.5176513 -0.0006485 -1.0827708 debye
dipolederiv: 2.3937592 0.0001286 -0.2819372 0.0001152 1.182376 0.0000442 -0.3257812 0.0000312 1.6033795 -0.7869373 -0.0728244 0.0155805 -0.1217493 -0.6267269 -0.1776587 0.0553175 -0.0040249 -0.5604695 -0.7870066 0.0727818 0.0154957 0.1217318 -0.6265926 0.1776964 0.0552674 0.0040656 -0.5605518 -0.7581872 -0.0000362 0.0909765 -0.00003 -0.360402 -0.0000948 0.2056255 -0.0000822 -0.915491 -1.7335576 -0.0002454 0.012663 -0.000244 -0.0924893 -0.0001228 -0.0123754 -0.0001259 -0.7308961 -0.505002 -0.0000304 -0.0306309 -0.0000635 -0.333799 0.0000172 -0.1542672 -0.0000037 -0.215611 0.2129643 -0.0693475 0.0106565 -0.3175848 0.0840353 0.0040314 0.0154555 0.0207892 -0.0630556 0.2128476 0.0693905 0.0106288 0.3176287 0.0841532 -0.0040808 0.0153328 -0.0208334 -0.063045 1.8395125 0.0002715 -0.008592 0.0002709 0.0495518 0.0000216 0.0095766 0.000024 0.1675741 -0.5069933 -0.0027994 0.0059925 -0.4124188 0.0421876 0.0055635 0.0079039 0.0031571 -0.219839 -0.5071233 0.0026283 0.0059926 0.4122463 0.0423079 -0.005662 0.0077438 -0.0032571 -0.2198366 0.1215031 -0.0733424 -0.0068547 -0.039908 0.0530521 0.0036987 -0.001085 -0.0080385 0.1496638 0.121461 0.0733622 -0.0068791 0.0399327 0.0530819 -0.003666 -0.0010996 0.008071 0.1496609 -0.0386494 0.0984689 0.0018416 0.0843719 -0.043097 -0.0028948 -0.0035364 -0.0025034 0.1734942 -0.0385909 -0.0984651 0.001879 -0.0843704 -0.0431499 0.0029781 -0.0035022 0.0025851 0.1734934 0.1433868 -0.0745435 0.0825868 -0.0295661 0.1432785 -0.0942366 0.0609071 -0.0538884 0.1772919 0.14337 0.0745703 0.0825299 0.0296037 0.1433519 0.0942628 0.0608668 0.0539302 0.1772269 0.2366341 -0.0172952 -0.0009614 -0.0574659 0.1244294 0.0004117 0.0038356 -0.0012773 0.3885058 0.236609 0.0173274 -0.0009682 0.0574995 0.1244513 -0.0003091 0.0038147 0.0013813 0.388505 unknown
polarizability: 164.3319407|0.0074778|109.4008682|-5.4132229|-0.0091315|64.9254016 unknown
InChI: InChI=1S/C6H8N2O2S/c7-5-1-3-6(4-2-5)11(8,9)10/h1-4H,7-8H2
charge 0 multiplicity 1
19 atoms
S  2.163777 0.000413 0.045542
O  2.657734 1.438653 0.640648
O  2.658188 -1.437416 0.641241
N  2.661168 0.000105 -1.733491
N  -3.886157 -0.000533 0.001552
C  0.307179 0.000108 0.015016
C  -0.367924 1.234322 0.017116
C  -0.367543 -1.23431 0.017582
C  -2.49693 -0.000327 0.006382
C  -1.772772 1.231859 0.01399
C  -1.772391 -1.232289 0.01446
H  0.197577 2.171314 0.046701
H  0.198242 -2.171122 0.047504
H  -2.317207 2.183118 0.021385
H  -2.316532 -2.183712 0.02222
H  3.209327 0.861125 -1.902852
H  3.209507 -0.860885 -1.902437
H  -4.408602 0.87087 0.004799
H  -4.408341 -0.872091 0.00514
