program: Gaussian 09
title: 000005503
version: EM64L-G09RevD.01
frameworkgroup: C1[X(C14H21N3O3S)]
method: RPBEPBE
basis: SDD
operation: Freq
keyword: #p
keyword: freq=noraman
keyword: PBEPBE/SDD
title: #p freq=noraman PBEPBE/SDD
converged: NO YES NO NO
title: Mulliken charges:
elementType: S O O O N N N C C C C C C C C C C C C C C H H H H H H H H H H H H H H H H H H H H H
charge: 0.994666 -0.297241 -0.488157 -0.547416 -0.048565 -0.385895 -0.673502 -0.399592 -0.363609 -0.355820 -0.388882 -0.395214 -0.364441 0.412929 -0.049909 -0.181801 -0.258479 0.453888 -0.371472 -0.374716 -0.799460 0.182253 0.201930 0.233056 0.183234 0.178336 0.237324 0.203429 0.194426 0.200388 0.212035 0.233187 0.208166 0.294011 0.334072 0.302314 0.290868 0.244740 0.244415 0.229485 0.242546 0.232471
chargesum: 0.00000
title: Mulliken charges with hydrogens summed into heavy atoms:
elementType: S O O O N N N C C C C C C C C C C C C C C
charge: 0.994666 -0.297241 -0.488157 -0.547416 -0.048565 -0.091884 -0.339430 -0.015408 0.052681 0.059840 0.008974 0.017209 0.076912 0.412929 -0.049909 0.120513 0.032389 0.453888 -0.126731 -0.130302 -0.094958
polarizability: 2.59632551e+02 1.15301009e+01 2.20304570e+02 -1.55650450e+01 9.37780391e+00 1.66909375e+02
1716.lowfreq: -10.7171 -8.5104 -3.1723 -0.0023 -0.0014 -0.0013 10.7952 16.1143 27.2779
frequency: 5.9935 15.1728 26.9516 38.1997 42.5204 51.1686 72.5704 98.1266 123.2532 134.3537 144.8461 156.4319 188.2948 207.2578 227.6754 242.5075 246.0456 288.6249 296.7274 307.2775 317.9023 334.9256 356.4957 380.9891 385.9187 402.6275 406.9992 423.5255 457.0705 482.3352 493.3834 512.5084 524.7850 580.5911 620.6863 642.8720 695.7453 705.5494 723.7348 725.6985 774.9016 795.2486 807.7260 813.8719 821.0444 839.8622 841.4650 867.3438 906.3394 949.8778 953.4520 961.9651 972.9606 979.6021 989.0462 989.5235 992.7537 1002.3595 1049.2368 1050.7849 1057.8811 1090.7255 1109.3724 1122.2721 1130.5822 1165.0187 1179.0173 1188.3039 1191.7324 1219.3118 1234.1213 1240.4693 1276.1604 1286.2795 1300.5326 1307.0551 1317.6308 1339.9345 1347.0904 1350.2287 1354.7812 1361.4200 1378.8856 1382.8903 1392.7276 1398.1560 1444.6556 1447.4610 1450.3985 1462.2818 1467.5949 1470.3833 1472.2867 1474.6640 1474.7355 1481.8593 1592.8883 1595.4716 1610.3528 2937.5597 2950.0761 2968.1679 2970.7601 2977.8471 2980.9663 2982.4550 3009.8762 3015.3731 3029.2936 3037.7370 3044.3698 3055.3954 3063.6370 3093.8976 3136.9225 3140.9451 3164.5068 3183.8442 3468.7183 3491.7779
redmass: 3.6968 4.3527 3.3489 1.0291 4.9720 4.2026 4.5662 4.8721 5.0567 7.3513 5.5590 5.2822 3.0945 5.0429 8.1076 2.6629 5.4296 4.7255 4.6225 3.1683 2.2526 2.9596 1.2673 3.6192 3.5150 5.1436 3.0992 5.7695 2.1855 1.5189 2.4486 1.9284 2.4603 5.5094 6.8944 4.0557 6.4094 3.1744 5.2117 3.1894 4.8166 2.2211 1.6681 8.4138 1.4853 2.5918 1.2549 1.5989 1.9107 6.0393 1.3413 3.5439 3.5235 1.3805 2.3141 1.7877 2.3664 2.1218 1.5908 2.4391 2.0718 1.9945 1.9722 1.3007 2.0938 1.5674 2.1987 1.1377 1.2813 3.0546 2.2155 1.3317 1.3637 1.1703 1.2574 1.7907 1.6348 1.2696 1.3360 1.4204 1.4025 1.3787 1.3234 7.2314 2.6504 1.2436 1.2177 1.1430 1.1321 1.0847 1.0918 1.0993 2.2193 1.0819 1.0880 1.0988 5.9996 6.9376 5.8528 1.0665 1.0619 1.0616 1.0640 1.0642 1.0390 1.0643 1.0972 1.0954 1.0984 1.1005 1.1008 1.0985 1.0947 1.1000 1.0895 1.0905 1.0958 1.0953 1.0776 1.0783
irintensity: 0.4001 0.5042 1.0881 0.4298 1.0754 0.9801 0.9529 3.1447 4.7803 4.5889 6.3639 0.8882 1.9999 5.1904 11.0439 1.1114 10.6310 8.4508 3.3240 5.0762 3.9437 3.3808 3.9371 2.4965 5.0914 8.6695 2.5321 96.0659 42.7974 18.7529 2.4633 189.5570 54.1164 10.5970 0.3130 89.3047 48.3355 2.6175 29.8646 0.6160 17.2381 5.3688 3.6486 130.2439 24.3386 10.4955 9.3746 4.0335 11.3480 52.5527 2.8048 17.3889 21.7947 0.6650 9.8642 8.2013 3.8368 6.2721 16.2359 24.7694 2.8948 90.4286 34.5999 10.5605 5.1913 10.4783 15.3176 12.9195 0.5068 4.4500 11.7230 2.1868 4.4345 3.0864 3.5111 154.2504 33.3303 1.6791 1.9948 2.2447 1.1672 1.9860 8.2313 1.5912 12.8707 16.0663 73.7411 38.9070 14.0089 3.9932 13.7875 17.2918 25.5844 22.9810 0.5022 7.2074 17.6874 0.1966 120.2175 80.7757 33.5842 7.8957 66.4271 64.4566 24.5090 74.3381 48.3204 25.6072 70.2921 13.2092 16.3470 76.5924 19.5814 15.0087 13.4391 7.9692 6.3844 7.2229 5.2122 31.6180
temp: 298.150 k
press: 1.00000 atm
elementType: 16 8 8 8 7 7 7 6 6 6 6 6 6 6 6 6 6 6 6 6 6 1 1 1 1 1 1 1 1 1 1 1 1 1 1 1 1 1 1 1 1 1
symmnumber: 1
zpe: 887147.3 jmol-1
zpe.correction: 0.337897 hartree
zpe.thermalcorrener: 0.360293 hartree
zpe.thermalcorrenthalpy: 0.361237 hartree
zpe.thermalcorrgfe: 0.282092 hartree
zpe.sumelectzpe: -1332.269683 hartree
zpe.sumelectthermal: -1332.247286 hartree
zpe.sumelectthermalent: -1332.246342 hartree
zpe.sumelectthermalfe: -1332.325488 hartree
dipole: -0.9095 4.0259 -3.3504
dipole: 5.3160
quadrupole: -117.7379 -133.6900 -132.9096
quadrupole: 20.6453 -3.2171 9.0259
quadrupole: 10.3746 -5.5775 -4.7971 20.6453 -3.2171 9.0259
hfenergy: -1332.6075791 hartree
pointgroup: C01 [X(C14H21N3O3S1)]
dipole: 0.3881329 1.8654889 0.8623009 debye
polarizability: 259.4316412|-16.0336439|212.8017273|-8.5796267|-22.223269|174.6131277 unknown
InChI: InChI=1S/C14H21N3O3S/c1-12-6-8-13(9-7-12)21(19,20)16-14(18)15-17-10-4-2-3-5-11-17/h6-9,15-16H,2-5,10-11H2,1H3
charge 0 multiplicity 1
42 atoms
S  -1.669504 -2.055798 0.344286
O  0.941155 -0.386056 -0.253691
O  -1.242551 -2.759019 -1.047358
O  -2.574311 -2.84278 1.445448
N  3.411417 -0.775228 1.219873
N  2.159879 -1.32532 1.54037
N  -0.154472 -1.68072 1.359832
C  3.915064 2.198099 -0.172955
C  3.987512 1.099827 -1.261368
C  3.136327 1.797796 1.09964
C  4.797887 -0.155718 -0.846313
C  3.707751 0.546733 1.820844
C  3.994448 -1.227569 -0.076137
C  0.988572 -1.081769 0.802802
C  -2.448123 -0.376442 0.006509
C  -1.981501 0.383175 -1.07714
C  -3.511361 0.007215 0.837718
C  -3.712624 2.055985 -0.522079
C  -2.633685 1.608554 -1.331789
C  -4.141728 1.239873 0.557756
C  -4.380498 3.390453 -0.797808
H  4.948995 2.491115 0.110599
H  3.443431 3.10191 -0.608878
H  2.961706 0.790971 -1.540247
H  4.454872 1.540118 -2.164884
H  3.161209 2.64534 1.816176
H  2.076152 1.612337 0.847054
H  5.178809 -0.664978 -1.754393
H  5.696129 0.145958 -0.269928
H  4.809122 0.637946 1.904305
H  3.316606 0.507113 2.855258
H  3.165775 -1.56228 -0.728798
H  4.653457 -2.104136 0.104549
H  2.147409 -2.032769 2.280634
H  -0.153921 -2.240932 2.221099
H  -1.139628 0.03574 -1.681248
H  -3.843569 -0.643607 1.652785
H  -2.295245 2.226691 -2.171001
H  -4.980124 1.566113 1.183466
H  -5.406715 3.423071 -0.393868
H  -3.813255 4.217338 -0.328271
H  -4.429971 3.60255 -1.880147
