program: Gaussian 09
title: 000040847
version: EM64L-G09RevD.01
frameworkgroup: C1[X(C10H16O2)]
method: RPBEPBE
basis: SDD
operation: Freq
keyword: #pfreq=noraman
keyword: PBEPBE/SDD
title: #p freq=noraman PBEPBE/SDD
converged: YES YES NO NO
title: Mulliken charges:
elementType: O O C C C C C C C C C C H H H H H H H H H H H H H H H H
charge: -0.259936 -0.178635 0.341443 -0.539232 -0.622556 -0.361686 0.080228 -0.585639 0.124449 -0.346086 -0.696323 -0.514744 0.199750 0.242927 0.246700 0.251330 0.207376 0.192372 0.250760 0.255263 0.193982 0.199500 0.216500 0.209617 0.210789 0.223418 0.240651 0.217783
chargesum: 0.00000
title: Mulliken charges with hydrogens summed into heavy atoms:
elementType: O O C C C C C C C C C C
charge: -0.259936 -0.178635 0.341443 -0.096555 -0.124526 0.038062 0.080228 -0.079616 0.124449 0.047397 -0.059418 0.167108
polarizability: 1.38217263e+02 -7.55715223e+00 1.20950451e+02 -6.28260271e+00 2.12553000e+00 8.23898123e+01
1716.lowfreq: -7.0829 -3.7333 -0.0007 0.0004 0.0006 6.6816 28.8830 54.8133 62.7137
frequency: 28.8289 54.8091 62.6952 70.1329 98.7249 110.8566 151.3113 179.5903 194.4326 216.3778 234.8483 258.8939 320.9120 396.4050 411.1164 470.6336 508.2864 523.8219 570.5849 607.7547 729.2137 757.8915 780.8134 794.9355 839.2975 893.9210 911.0241 940.4980 968.6325 1003.3882 1038.2182 1069.3659 1085.9844 1094.8381 1108.0595 1109.2950 1139.8860 1153.6009 1169.7489 1192.5366 1201.6949 1224.3891 1253.9706 1271.1547 1284.4200 1288.5921 1321.1244 1332.3764 1348.9481 1388.9751 1424.6160 1428.3671 1441.5574 1459.1267 1465.1787 1467.0686 1470.8690 1476.0366 1476.3002 1486.6599 1662.9637 1693.8996 2945.2902 2958.5141 2959.4989 2960.9730 2969.4154 2971.9315 2975.0021 3000.0664 3001.6391 3020.0573 3025.3642 3047.2878 3048.8357 3068.6449 3070.9551 3119.2371
redmass: 2.6283 2.3859 2.8171 2.6972 2.8645 2.2915 1.4736 1.9592 2.4547 1.1926 3.0396 2.5409 3.4350 3.5000 3.6016 2.3469 3.6146 6.6191 3.6472 4.2422 1.0872 3.6684 1.3319 2.7086 1.6175 1.7624 1.4322 4.0477 1.9465 4.6315 2.5322 2.4894 1.5357 1.6726 1.7771 1.2984 1.4581 1.3125 3.8067 2.0732 1.6422 1.4818 1.3611 1.7450 1.5883 1.0666 1.6928 2.2970 1.6485 1.2156 1.0803 1.0988 1.1687 1.0849 1.0534 1.0698 1.0496 1.0575 1.0532 1.0833 10.3469 9.4027 1.0664 1.0438 1.0501 1.0580 1.0605 1.0367 1.0588 1.0974 1.0979 1.0991 1.0990 1.1032 1.0986 1.1007 1.0993 1.0997
irintensity: 0.5345 0.5708 4.8231 8.1356 5.3242 0.1636 2.6184 1.6388 6.3112 0.1341 0.2121 1.5891 3.7873 3.2216 5.2447 0.1702 6.8154 1.7820 9.0468 8.8793 8.5793 9.4279 1.3185 1.6036 0.4880 8.2250 6.8154 21.7671 2.0780 7.6670 12.8238 0.8523 0.3805 1.5634 5.7543 3.5137 5.5690 4.9835 91.5698 77.2859 1.3494 31.9197 5.9337 22.0901 94.4591 0.7592 8.7240 53.3304 4.2414 12.4811 15.3477 0.5148 1.7571 2.3823 12.2608 1.2033 22.0659 7.8429 8.0512 17.3764 219.4785 47.0140 26.4809 88.7458 5.2143 3.5404 71.2559 49.2381 30.2220 13.9542 0.7251 6.2305 17.4976 39.8532 39.8015 92.3270 54.8728 24.0287
temp: 298.150 k
press: 1.00000 atm
elementType: 8 8 6 6 6 6 6 6 6 6 6 6 1 1 1 1 1 1 1 1 1 1 1 1 1 1 1 1
symmnumber: 1
zpe: 623632.2 jmol-1
zpe.correction: 0.237529 hartree
zpe.thermalcorrener: 0.251527 hartree
zpe.thermalcorrenthalpy: 0.252471 hartree
zpe.thermalcorrgfe: 0.195268 hartree
zpe.sumelectzpe: -540.129189 hartree
zpe.sumelectthermal: -540.115191 hartree
zpe.sumelectthermalent: -540.114247 hartree
zpe.sumelectthermalfe: -540.171450 hartree
dipole: 0.7329 2.7450 0.5752
dipole: 2.8988
quadrupole: -74.6213 -77.9397 -72.7967
quadrupole: -14.3172 -1.2038 5.1457
quadrupole: 0.4979 -2.8205 2.3225 -14.3172 -1.2038 5.1457
hfenergy: -540.3667183 hartree
pointgroup: C01 [X(C10H16O2)]
dipole: 0.4532746 -1.0171123 -0.2463035 debye
polarizability: 135.1029621|9.3393481|123.2419421|8.2416421|4.8621138|83.2126222 unknown
InChI: InChI=1S/C10H16O2/c1-3-4-5-8-6-9(11)7-10(8)12-2/h3-7H2,1-2H3
charge 0 multiplicity 1
28 atoms
O  -0.74822 -2.237295 0.131332
O  -3.020603 2.096638 -0.439094
C  -0.083774 0.093156 0.320902
C  1.337877 -0.148157 0.764427
C  -0.697051 1.480077 0.203409
C  2.402738 0.523799 -0.145561
C  -1.010682 -0.861942 0.009453
C  -2.370935 -0.300015 -0.367375
C  -2.149898 1.221802 -0.229396
C  3.845178 0.267168 0.345998
C  4.913551 0.925115 -0.553332
C  -1.522518 -3.13299 -0.738065
H  1.476739 0.235517 1.798817
H  1.523148 -1.237418 0.803401
H  -0.684344 2.052222 1.154999
H  -0.196144 2.129168 -0.543995
H  2.289679 0.14352 -1.180966
H  2.225073 1.618091 -0.190022
H  -2.700944 -0.536238 -1.398657
H  -3.189389 -0.621822 0.308325
H  3.948055 0.646291 1.38364
H  4.022863 -0.826382 0.396606
H  5.934757 0.733167 -0.175676
H  4.771568 2.021444 -0.600927
H  4.856792 0.53517 -1.587175
H  -2.611563 -3.017275 -0.576821
H  -1.21763 -4.15104 -0.452872
H  -1.286723 -2.958973 -1.806173
