program: Gaussian 09
title: 000040879
version: EM64L-G09RevD.01
frameworkgroup: C1[X(C16H21N)]
method: RPBEPBE
basis: SDD
operation: Freq
keyword: #pfreq=noraman
keyword: PBEPBE/SDD
title: #p freq=noraman PBEPBE/SDD
converged: NO YES NO NO
title: Mulliken charges:
elementType: N C C C C C C C C C C C C C C C C H H H H H H H H H H H H H H H H H H H H H
charge: -0.076478 -0.150236 -0.167778 -0.076685 -0.135447 -0.508376 -0.500718 -0.483240 -0.588507 -0.620690 0.276155 0.293467 -0.647363 -0.385507 -0.411314 -0.256187 -0.253685 0.226088 0.228021 0.221568 0.227163 0.237318 0.197192 0.229495 0.216210 0.213629 0.229688 0.210521 0.271065 0.211833 0.219511 0.227442 0.225900 0.195867 0.230858 0.228323 0.222280 0.222614
chargesum: 0.00000
title: Mulliken charges with hydrogens summed into heavy atoms:
elementType: N C C C C C C C C C C C C C C C C
charge: -0.076478 0.075852 0.060243 0.144884 0.091716 -0.073866 -0.055013 -0.039922 -0.106922 -0.189346 0.276155 0.293467 0.001847 -0.154649 -0.182991 -0.033907 -0.031070
polarizability: 2.12361354e+02 1.45777175e+00 1.65443846e+02 -1.07139767e+01 3.24078763e+00 1.21549415e+02
1716.lowfreq: -9.2233 -0.0007 0.0002 0.0006 0.6409 16.0272 39.7506 91.6329 124.1607
frequency: 39.7420 91.6150 124.1241 182.2139 191.7474 203.6353 218.7386 235.9467 272.2007 274.9616 288.9177 334.9325 372.6374 420.3029 434.6240 470.5070 490.2127 512.3035 538.3503 591.3982 620.8285 656.6907 699.6438 711.9422 722.3810 746.2406 750.2339 766.4534 789.6109 814.5736 828.0301 853.5280 873.2813 891.1348 909.0074 921.0820 944.6901 964.0700 973.2252 981.7997 983.0600 1005.8940 1015.7383 1037.0290 1050.7434 1056.9731 1091.2406 1105.9539 1109.3480 1125.1723 1128.7070 1143.9687 1150.3608 1171.2550 1177.0848 1192.7470 1201.5596 1207.6278 1212.2076 1224.5295 1234.6618 1245.7835 1257.3620 1265.9406 1275.2100 1290.0966 1295.5743 1298.1641 1315.2491 1329.6073 1340.5871 1353.7771 1361.7785 1376.8718 1384.6601 1429.5804 1439.3478 1451.4815 1453.1375 1463.5214 1465.4972 1468.4541 1482.6200 1487.9629 1492.0276 1592.8746 1612.4238 2882.2129 2944.0687 2953.8973 2960.8601 2975.2229 2980.0765 2998.0282 3004.6559 3006.9314 3009.6272 3019.8702 3022.9007 3039.7078 3046.1752 3051.0132 3075.0120 3075.3137 3105.3001 3109.7633 3131.8937 3154.9638
redmass: 3.7656 3.5626 3.3054 2.3490 1.1634 2.2305 2.6539 3.3655 2.2011 2.6878 2.8853 3.0132 2.0445 3.3146 2.9453 3.0876 3.9185 3.5705 4.1138 4.4150 2.9953 3.2555 4.1409 3.2449 4.0198 3.4309 1.3516 3.1792 1.8408 1.9900 3.4786 1.8577 1.8105 2.6001 2.2705 1.8636 1.6114 2.1017 2.0397 1.4295 2.0702 1.9754 2.1646 2.3106 1.9322 2.0910 1.9881 1.7408 1.6313 1.7374 1.8604 1.3975 1.4144 1.0792 1.2711 1.7169 1.5966 1.4607 1.4376 1.6900 1.5206 1.4923 1.3755 1.6545 1.4591 1.3540 1.4388 1.5870 1.3661 1.5251 1.6439 1.4554 1.5825 1.8351 3.0580 1.1675 2.3805 1.1246 1.1051 1.0845 1.0666 1.1181 1.0503 1.1021 2.1344 6.5169 6.3951 1.0533 1.0653 1.0593 1.0824 1.0785 1.0669 1.0599 1.0960 1.0977 1.0667 1.0758 1.0840 1.0876 1.1007 1.1034 1.1040 1.1013 1.0862 1.0890 1.0924 1.1004
irintensity: 0.0736 0.0614 0.5186 0.4738 0.1607 0.8377 0.3757 4.6122 1.7958 1.2821 0.8920 1.6643 0.5147 1.7853 5.3626 4.3463 1.2304 5.4394 1.6181 1.0294 1.8863 10.8027 8.4217 2.9496 2.9834 6.1526 65.7872 4.9463 5.7507 2.8512 9.6441 1.7629 2.0867 2.4031 5.3364 6.7022 4.1409 5.0349 1.6941 0.0710 0.0872 4.1233 1.3131 6.6973 12.9916 5.8890 6.8327 7.7164 3.3385 11.4299 24.3794 1.0935 1.0935 1.7687 7.9868 4.2251 6.3048 1.5353 3.1574 2.0316 1.8427 1.5687 2.2246 3.3154 1.6683 5.2298 5.8752 2.8189 4.4650 7.3239 2.6905 6.2152 4.4754 0.9264 0.8673 5.2747 4.8316 6.4993 12.6332 2.5007 11.0951 12.0040 3.4807 38.5411 20.5577 7.2977 1.9251 129.0879 25.7741 28.4299 14.1959 55.4930 34.5033 14.4661 22.1607 35.4971 40.0260 52.3045 85.7771 32.9706 37.2381 5.1954 63.9666 42.0213 17.9770 2.1279 32.4535 42.0073
temp: 298.150 k
press: 1.00000 atm
elementType: 7 6 6 6 6 6 6 6 6 6 6 6 6 6 6 6 6 1 1 1 1 1 1 1 1 1 1 1 1 1 1 1 1 1 1 1 1 1
symmnumber: 1
zpe: 873934.9 jmol-1
zpe.correction: 0.332864 hartree
zpe.thermalcorrener: 0.346700 hartree
zpe.thermalcorrenthalpy: 0.347644 hartree
zpe.thermalcorrgfe: 0.293138 hartree
zpe.sumelectzpe: -675.778926 hartree
zpe.sumelectthermal: -675.765090 hartree
zpe.sumelectthermalent: -675.764146 hartree
zpe.sumelectthermalfe: -675.818652 hartree
dipole: -2.1283 -0.4546 0.3981
dipole: 2.2124
quadrupole: -98.6377 -97.0108 -103.8830
quadrupole: -1.3934 -0.9745 1.4221
quadrupole: 1.2061 2.8331 -4.0392 -1.3934 -0.9745 1.4221
hfenergy: -676.1117899 hartree
pointgroup: C01 [X(C16H21N1)]
dipole: -0.837411 0.1561114 -0.1789291 debye
polarizability: 212.0742221|-0.0870219|165.6666245|11.9735268|0.5218855|121.6137679 unknown
InChI: InChI=1S/C16H21N/c1-17-14-6-7-16(17)15-10-12-5-3-2-4-11(12)8-13(15)9-14/h2-5,13-16H,6-10H2,1H3
charge 0 multiplicity 1
38 atoms
N  -2.313037 -0.947936 0.608225
C  -0.679412 -0.172383 -1.080087
C  -2.120429 -0.731433 -0.86343
C  -0.55203 1.212582 -0.377724
C  -2.498381 0.458168 1.09388
C  -1.108385 1.148309 1.0704
C  -3.230873 0.307256 -1.262665
C  -3.493234 1.10676 0.06016
C  0.359131 -1.200003 -0.564782
C  0.890446 1.761024 -0.46772
C  1.739481 -0.645536 -0.237651
C  1.978736 0.751065 -0.123805
C  -3.43108 -1.857903 0.943691
C  2.805433 -1.546903 0.020224
C  3.266426 1.205955 0.259667
C  4.086234 -1.08774 0.391186
C  4.318671 0.302629 0.517106
H  -0.52781 -0.015636 -2.168866
H  -2.229048 -1.693182 -1.398335
H  -1.191814 1.924773 -0.93846
H  -2.902095 0.449125 2.122075
H  -0.422522 0.578904 1.725348
H  -1.189503 2.174198 1.482378
H  -4.144755 -0.21487 -1.598113
H  -2.903977 0.960209 -2.092022
H  -3.311928 2.189967 -0.058198
H  -4.538129 0.982986 0.397185
H  0.456432 -2.02445 -1.300015
H  -0.066942 -1.650975 0.354848
H  0.991352 2.655232 0.179503
H  1.064427 2.116084 -1.50626
H  -3.508052 -1.946372 2.042322
H  -3.215012 -2.862684 0.538119
H  -4.428341 -1.538841 0.554958
H  2.620099 -2.62544 -0.067922
H  3.442999 2.285687 0.352606
H  4.893597 -1.803432 0.584225
H  5.306326 0.674804 0.812347
