program: Gaussian 09
title: 000040913
version: EM64L-G09RevD.01
frameworkgroup: C1[X(C18H24O2)]
method: RPBEPBE
basis: SDD
operation: Freq
keyword: #pfreq=noraman
keyword: PBEPBE/SDD
title: #p freq=noraman PBEPBE/SDD
converged: YES YES NO NO
title: Mulliken charges:
elementType: O O C C C C C C C C C C C C C C C C C C H H H H H H H H H H H H H H H H H H H H H H H H
charge: -0.443245 -0.438324 0.311475 -0.200437 -0.075141 -0.168292 -0.152996 -0.477631 -0.484234 -0.482613 -0.500240 -0.493536 -0.787907 0.258373 -0.583745 0.319033 -0.349983 -0.582530 -0.410078 0.290701 0.211378 0.217676 0.207320 0.201442 0.199477 0.223793 0.211360 0.220067 0.198092 0.215121 0.241370 0.220244 0.221987 0.207537 0.195429 0.213932 0.230816 0.221931 0.220193 0.327690 0.222445 0.222834 0.248593 0.350626
chargesum: 0.00000
title: Mulliken charges with hydrogens summed into heavy atoms:
elementType: O O C C C C C C C C C C C C C C C C C C
charge: -0.115555 -0.087698 0.311475 0.010940 0.142534 0.039027 0.048446 -0.054362 -0.052807 -0.069400 -0.038625 -0.064012 -0.147731 0.258373 -0.141622 0.319033 -0.127538 -0.359696 -0.161485 0.290701
polarizability: 2.51994433e+02 2.83650651e-01 1.84043803e+02 -2.18897687e+00 7.17466744e+00 1.38033433e+02
1716.lowfreq: -11.7948 -4.7491 -0.0004 -0.0002 0.0009 16.7213 35.8653 60.9456 88.2108
frequency: 35.8640 60.9412 88.1617 111.2657 131.6359 161.0170 177.2144 188.1908 201.6170 222.7149 236.4291 248.4103 263.4013 275.7345 306.5048 336.2828 351.2486 356.5545 382.8152 406.7974 413.9218 443.4882 446.7993 460.5135 490.1272 515.9846 544.1320 555.9457 568.0824 612.6410 619.0492 638.0709 699.4008 712.1956 727.5290 785.1869 805.1006 815.5979 827.3333 842.3260 844.3467 861.0313 899.6726 900.3393 926.4494 948.5078 953.9401 966.1116 988.1831 995.8287 1007.3198 1011.9748 1033.2614 1037.3462 1050.8682 1071.6323 1082.8317 1092.5201 1112.4885 1130.2815 1132.4416 1137.0698 1148.1603 1174.6105 1178.2256 1188.5339 1195.6725 1215.3307 1220.2504 1232.5501 1238.5250 1244.8030 1252.5602 1262.8362 1270.7399 1281.3600 1284.4817 1287.7817 1292.0334 1305.9635 1322.2000 1332.4459 1335.5191 1336.8159 1349.8034 1358.9730 1366.0178 1371.4241 1382.9412 1386.1581 1427.3286 1453.5332 1456.7834 1468.1751 1469.9005 1473.9049 1476.5652 1483.1992 1493.1933 1499.9723 1601.2572 1619.4993 2912.1525 2916.8819 2929.2951 2942.0894 2953.0079 2957.2941 2971.8871 2977.5265 2985.0809 3000.8824 3013.4845 3020.6331 3031.9244 3032.3725 3040.5254 3043.8963 3050.3857 3072.4275 3081.8964 3090.8071 3137.3420 3170.2944 3550.4631 3580.6535
redmass: 4.2330 3.8423 4.4726 2.4103 3.8416 2.6663 2.2579 1.2229 3.8459 2.8791 2.9580 2.3956 1.8298 1.8781 2.6554 2.8706 1.1308 2.5237 3.3903 3.6280 3.0512 3.1767 3.0849 4.2705 2.8691 4.1719 3.3582 3.1694 3.4929 2.9733 3.9678 3.0861 2.5700 4.2730 3.8967 2.1113 1.6398 1.9199 1.5581 1.8612 1.9681 1.9078 2.5571 2.0101 2.6796 1.6166 1.4498 1.9301 2.3011 2.7154 2.0180 2.2179 2.1364 2.3609 1.7987 2.7081 1.7805 1.9439 1.8412 1.4789 1.9735 1.8477 1.8031 1.5020 1.6329 1.6068 1.5180 1.8136 1.2519 1.2824 1.7321 1.4703 1.4233 1.7672 1.5405 1.3634 1.3616 1.3624 1.4619 1.4176 1.3675 1.5083 1.5551 1.5313 1.5216 1.6193 1.5909 1.4654 3.8629 1.2945 3.3913 1.1205 1.0680 1.0858 1.0908 1.0772 1.0753 1.0561 1.0926 2.7539 6.6244 6.6437 1.0789 1.0842 1.0824 1.0839 1.0640 1.0392 1.0611 1.0607 1.0629 1.0596 1.0945 1.0624 1.0979 1.1027 1.0974 1.1009 1.1031 1.0962 1.1037 1.0907 1.0875 1.0957 1.0660 1.0659
irintensity: 0.1850 0.3800 0.2692 0.5788 0.6905 0.1545 0.0980 3.4300 0.5060 0.6195 4.4264 2.4390 67.1013 83.4919 23.1490 4.3135 140.4711 1.5131 2.2391 1.0215 3.7682 5.2329 10.5743 31.7665 1.1406 0.5026 1.8971 3.1729 1.3111 3.9962 5.0828 1.6905 1.5170 5.4568 1.7326 10.9430 6.4942 5.3649 5.7681 15.1488 9.6128 23.6689 20.8888 6.0950 2.6523 1.3617 0.8848 26.2561 54.7538 15.7046 1.3611 5.1805 1.1112 21.3038 1.1379 5.2033 0.0580 0.2645 2.2912 2.4911 150.4571 90.6473 20.1329 20.2564 7.1814 13.5877 14.9123 3.3785 2.1575 21.7068 0.7412 7.0374 1.2056 13.4794 6.8556 3.2064 7.3241 5.3248 3.1242 9.2518 3.1904 0.5057 6.6748 0.6370 1.1261 7.0398 5.0900 7.8741 8.7662 14.1455 39.8867 9.5389 0.8768 8.5977 9.3014 11.3738 1.4201 6.7241 17.1675 84.7210 9.8969 64.0509 4.5128 34.1124 35.7955 52.8021 30.7109 51.1723 42.2764 34.0012 28.5315 32.0644 37.9818 32.8018 24.2667 43.0110 58.6403 52.9186 15.4552 33.6844 61.8396 26.0482 12.5427 10.8358 3.0175 35.5766
temp: 298.150 k
press: 1.00000 atm
elementType: 8 8 6 6 6 6 6 6 6 6 6 6 6 6 6 6 6 6 6 6 1 1 1 1 1 1 1 1 1 1 1 1 1 1 1 1 1 1 1 1 1 1 1 1
symmnumber: 1
zpe: 995615.5 jmol-1
zpe.correction: 0.379210 hartree
zpe.thermalcorrener: 0.397267 hartree
zpe.thermalcorrenthalpy: 0.398212 hartree
zpe.thermalcorrgfe: 0.334742 hartree
zpe.sumelectzpe: -849.255540 hartree
zpe.sumelectthermal: -849.237482 hartree
zpe.sumelectthermalent: -849.236538 hartree
zpe.sumelectthermalfe: -849.300007 hartree
dipole: 0.1811 2.4142 2.0043
dipole: 3.1430
quadrupole: -127.0452 -115.1957 -121.6326
quadrupole: -8.7791 5.0158 -0.0878
quadrupole: -5.7541 6.0955 -0.3414 -8.7791 5.0158 -0.0878
hfenergy: -849.6347495 hartree
pointgroup: C01 [X(C18H24O2)]
dipole: 0.0828849 -0.9339602 -0.8061923 debye
polarizability: 252.0009001|0.7501863|183.7704415|1.677055|8.0461252|138.3003271 unknown
InChI: InChI=1S/C18H24O2/c1-18-9-8-14-13-5-3-12(19)10-11(13)2-4-15(14)16(18)6-7-17(18)20/h3,5,10,14-17,19-20H,2,4,6-9H2,1H3
charge 0 multiplicity 1
44 atoms
O  5.000068 1.27067 0.298134
O  -5.917964 0.444755 0.059492
C  2.776422 0.35873 -0.596613
C  2.034724 -0.975989 -0.250214
C  0.49964 -0.897372 -0.440953
C  -0.128388 0.296419 0.327444
C  4.182874 0.078256 0.026274
C  2.083218 1.561524 0.107822
C  2.534659 -1.354798 1.184612
C  0.554689 1.613937 -0.126849
C  3.913935 -0.645048 1.362902
C  -0.222272 -2.21055 -0.070151
C  2.882369 0.606548 -2.118413
C  -1.6614 0.305802 0.209515
C  -1.684965 -2.15957 -0.555118
C  -2.388785 -0.857434 -0.177414
C  -2.402006 1.472477 0.543517
C  -3.805012 -0.817865 -0.230509
C  -3.807029 1.516185 0.492162
C  -4.511644 0.358216 0.097029
H  2.40848 -1.755646 -0.950659
H  0.314331 -0.71911 -1.524777
H  0.113686 0.166777 1.407282
H  4.73266 -0.594016 -0.672681
H  2.549443 2.505156 -0.235165
H  2.274084 1.511841 1.197481
H  2.618303 -2.450531 1.294052
H  1.822224 -1.014622 1.95826
H  0.14884 2.478251 0.431272
H  0.32044 1.794342 -1.19545
H  3.882336 0.113133 2.165567
H  4.727355 -1.346915 1.613758
H  -0.190848 -2.354989 1.028278
H  0.294824 -3.077454 -0.527287
H  3.526374 1.483357 -2.334931
H  3.317835 -0.269801 -2.636286
H  1.898731 0.811866 -2.576719
H  -2.257339 -3.019937 -0.156959
H  -1.698207 -2.26532 -1.660724
H  5.218528 1.711758 -0.56183
H  -1.870391 2.376856 0.85836
H  -4.353098 -1.72384 -0.528148
H  -4.364927 2.420293 0.752539
H  -6.312496 -0.415643 -0.228102
