program: Gaussian 09
title: 000005340
version: EM64L-G09RevD.01
frameworkgroup: C1[X(C9H9N3O2S2)]
method: RPBEPBE
basis: SDD
operation: Freq
keyword: #p
keyword: freq=noraman
keyword: PBEPBE/SDD
title: #p freq=noraman PBEPBE/SDD
converged: YES YES NO NO
title: Mulliken charges:
elementType: S S O O N N N C C C C C C C C C H H H H H H H H H
charge: 0.931349 0.253321 -0.536709 -0.500280 -0.437624 -0.685444 -0.004111 -0.098398 -0.220774 -0.159218 0.517070 -0.386831 -0.396834 -0.132807 -0.484666 -0.155915 0.282056 0.281497 0.310249 0.231642 0.231636 0.315891 0.316528 0.270853 0.257521
chargesum: 0.00000
title: Mulliken charges with hydrogens summed into heavy atoms:
elementType: S S O O N N N C C C C C C C C C
charge: 0.931349 0.253321 -0.536709 -0.500280 -0.127375 -0.053025 -0.004111 -0.098398 0.061282 0.122278 0.517070 -0.155189 -0.165198 -0.132807 -0.213813 0.101606
polarizability: 3.10687940e+02 8.17784291e+00 1.83315595e+02 -1.04205550e+01 -1.82337160e+01 1.01102078e+02
1716.lowfreq: -3.9076 0.0005 0.0013 0.0019 3.7028 11.7297 13.5570 27.2537 36.2750
frequency: 12.9780 27.2382 36.2467 70.9306 82.1654 133.5941 136.3374 158.1154 186.2783 229.3870 281.5137 297.8645 331.3054 370.3939 392.9419 404.1503 410.1836 414.8918 427.7873 444.6553 498.4347 518.2861 530.9944 589.0261 601.7866 621.3052 626.2795 704.9441 718.9808 728.6268 775.4896 803.5979 810.5693 816.1373 832.8904 840.8049 870.2331 942.2824 948.3238 965.7256 980.2793 1000.9504 1022.7435 1051.5214 1074.0585 1133.8753 1186.6895 1217.4159 1262.6148 1296.3717 1303.2673 1325.0644 1400.4373 1428.2913 1438.6205 1489.7939 1493.2212 1582.9836 1614.1515 1648.3932 3135.8253 3138.9015 3165.3553 3174.4297 3197.9790 3245.7390 3418.8224 3561.1981 3700.2038
redmass: 4.1606 8.2060 6.8228 7.0706 7.0526 7.7130 7.0847 9.7205 9.4529 9.0533 7.0066 6.3865 6.1918 5.1007 11.2999 3.2417 2.1633 1.1739 2.7155 1.7046 4.6261 2.7226 7.1669 6.2771 5.9023 6.5445 5.6527 2.4244 2.8605 1.7058 2.2167 4.6493 1.3298 5.8946 1.8159 5.1419 1.3440 8.8497 1.4425 1.3589 5.0025 3.1686 1.4448 2.5403 1.2603 1.1970 1.1139 1.2583 2.5436 2.2573 1.2985 2.5606 5.4038 5.1105 3.8681 3.0639 5.5841 7.3276 4.8586 1.2219 1.0893 1.0898 1.0957 1.0959 1.0917 1.1004 1.0767 1.0453 1.1040
irintensity: 0.3026 1.9131 2.1622 0.1094 1.4991 0.8152 1.1825 6.5201 2.8537 16.5308 30.6511 0.6275 11.4187 18.1057 72.4667 1.5209 0.8942 1.4178 58.8499 406.0788 20.1306 29.1393 2.8959 6.2151 20.7971 9.4107 34.2885 68.7364 3.6032 32.7832 147.6557 30.5801 1.9842 108.4298 85.0705 3.2305 1.6368 44.5659 3.7116 0.2370 9.5392 108.3589 2.1247 75.0819 6.9011 16.4342 59.6845 26.8840 27.8214 2.6698 6.9464 81.2635 4.9767 31.0081 2.1922 67.5327 25.4475 7.4578 219.5623 290.1835 13.2731 14.0733 7.6626 7.1775 9.5697 1.2732 29.0835 140.4542 25.9745
temp: 298.150 k
press: 1.00000 atm
elementType: 16 16 8 8 7 7 7 6 6 6 6 6 6 6 6 6 1 1 1 1 1 1 1 1 1
symmnumber: 1
zpe: 450291.6 jmol-1
zpe.correction: 0.171507 hartree
zpe.thermalcorrener: 0.187514 hartree
zpe.thermalcorrenthalpy: 0.188458 hartree
zpe.thermalcorrgfe: 0.125276 hartree
zpe.sumelectzpe: -1457.838365 hartree
zpe.sumelectthermal: -1457.822358 hartree
zpe.sumelectthermalent: -1457.821413 hartree
zpe.sumelectthermalfe: -1457.884595 hartree
dipole: 4.3323 -4.9639 -2.1610
dipole: 6.9339
quadrupole: -64.1320 -105.8149 -114.5561
quadrupole: -5.9581 -3.8178 -9.8992
quadrupole: 30.7023 -10.9805 -19.7218 -5.9581 -3.8178 -9.8992
hfenergy: -1458.0098716 hartree
pointgroup: C01 [X(C9H9N3O2S2)]
dipole: -1.8204373 2.0230292 -0.1883747 debye
dipolederiv: 2.6280843 0.0259114 -0.1627929 -0.2361657 1.2984902 -0.0976295 -0.5502146 -0.2411391 1.1396513 -0.4710438 0.0651055 0.0569982 0.2467944 -0.0130167 -0.1621718 0.3648019 -0.0138029 -0.000685 -0.895254 -0.126862 0.0401838 -0.2601745 -0.8719041 -0.0313439 0.0090647 -0.2018752 -0.4860071 -0.723916 0.0778091 -0.0383829 0.0043991 -0.4604392 0.0199905 0.3567623 0.3787603 -0.6077978 -0.9071377 -0.2044907 -0.1667358 0.3424431 -0.0756589 -0.0377832 -0.1949518 -0.1240369 -0.4973283 -1.6441533 0.4768977 0.2250738 0.7058915 -0.6846777 0.2344086 0.2331133 0.2420567 -0.4028501 -0.3338467 0.2375756 0.0874305 0.3012434 -0.2706001 -0.222556 0.2363529 -0.1518877 -0.3358429 -0.5450234 0.0947279 -0.0227257 0.2586504 -0.4063371 -0.0649567 -0.1189312 0.0277314 -0.2328676 0.4136372 -0.1269578 0.0603438 0.0504469 0.0029692 0.0384565 0.4133349 -0.0207177 -0.0194559 0.0838029 -0.1057279 -0.0137557 -0.3871686 0.1655158 0.0919095 -0.2392358 0.114675 0.0168736 1.6281408 -0.6436694 -0.1113515 -0.867023 0.4795349 0.0043203 -0.1253146 -0.0056919 0.1246082 -0.3551291 0.0855806 0.0876081 0.5108441 -0.2876196 0.0783559 0.4140948 -0.0397614 -0.1076783 -0.6878625 0.2086959 0.084308 -0.0230974 -0.0417655 0.1261183 -0.2307002 0.2273395 -0.0700238 1.21799 0.0181334 -0.016278 -0.1351954 0.2395617 0.2797107 0.0161038 0.2322596 0.1237626 0.0291224 0.0990207 -0.0519286 -0.4507112 -0.2109189 0.2749159 -0.4278175 0.0547793 -0.0864709 -0.4193698 -0.315267 0.071854 0.1051141 0.1027749 0.1514187 0.0757982 0.1618425 0.0421376 0.186284 0.0522467 0.0189041 -0.0205221 0.0696313 -0.0656212 0.0107408 -0.037914 0.1037902 0.1023434 -0.022984 -0.0659635 -0.0342799 0.1025466 -0.0120721 -0.0585018 -0.017523 0.1166847 0.0931337 0.0412339 0.1099494 -0.1455109 0.0799409 -0.0034805 0.0994926 0.0155506 0.2627652 -0.0914914 -0.0098137 -0.1052014 0.0428091 0.1036291 -0.0603884 -0.1165767 -0.0642496 0.0728142 0.026505 0.056821 0.0093232 0.0955699 0.0071213 -0.1318682 -0.0035691 -0.1142381 0.0589502 0.2932419 0.010053 -0.0545804 0.0374797 0.2354109 -0.1216521 -0.0089224 -0.1310024 0.2477473 0.2211175 0.0072816 -0.0748389 -0.051588 0.2738694 -0.1050499 -0.1201179 -0.0933371 0.2574054 0.0501515 -0.0436804 -0.0113864 -0.051343 0.1309589 -0.0804972 -0.0284942 -0.0884766 0.1766967 0.1006732 0.0423589 0.0439447 -0.038906 0.0309829 -0.102534 -0.0063126 -0.1093412 0.1031205 unknown
polarizability: 310.3751106|14.046877|168.2658795|0.7420502|37.1701881|116.4646226 unknown
InChI: InChI=1S/C9H9N3O2S2/c10-7-1-3-8(4-2-7)16(13,14)12-9-11-5-6-15-9/h1-6,12H,10H2
charge 0 multiplicity 1
25 atoms
S  0.428886 -1.539678 -0.077983
S  4.326165 0.289841 -0.869635
O  0.219555 -2.895514 -0.961519
O  1.126901 -1.554974 1.391646
N  1.565007 -0.372468 -1.326314
N  -4.816511 1.433059 0.218531
N  2.10603 1.475508 0.107688
C  -1.173642 -0.618794 0.009066
C  -2.21682 -1.013832 -0.849159
C  -1.292534 0.445679 0.923415
C  -3.607916 0.754152 0.146367
C  -3.439621 -0.328106 -0.772328
C  -2.517055 1.127834 0.992071
C  2.448435 0.469665 -0.699355
C  4.460228 1.721556 0.188784
C  3.207317 2.156806 0.607058
H  -2.074129 -1.849975 -1.540956
H  -0.447746 0.729771 1.557611
H  1.978037 -1.074726 -1.964481
H  -4.270438 -0.625258 -1.422255
H  -2.63513 1.959141 1.696212
H  -5.5967 1.177325 -0.380252
H  -4.944412 2.204816 0.867143
H  5.431357 2.162043 0.404356
H  3.042935 3.007528 1.26959
