program: Gaussian 09
title: 000005406
version: EM64L-G09RevD.01
frameworkgroup: C1[X(C20H28N4O)]
method: RPBEPBE
basis: SDD
operation: Freq
keyword: #p
keyword: freq=noraman
keyword: PBEPBE/SDD
title: #p freq=noraman PBEPBE/SDD
converged: YES YES NO NO
title: Mulliken charges:
elementType: O N N N N C C C C C C C C C C C C C C C C C C C C H H H H H H H H H H H H H H H H H H H H H H H H H H H H
charge: -0.323472 -0.065237 -0.430304 -0.405037 -0.161999 -0.231410 -0.174311 -0.498918 -0.011438 -0.613103 -0.462421 0.492094 -0.201998 0.368254 0.228037 -0.646138 -0.502406 -0.446372 -0.374941 -0.203239 0.284899 -0.348972 -0.402828 -0.659978 -0.651068 0.243792 0.240824 0.209356 0.255607 0.268270 0.223417 0.222703 0.156206 0.228443 0.190525 0.226124 0.225458 0.286536 0.240404 0.262738 0.300475 0.225363 0.214108 0.198557 0.258775 0.226488 0.217305 0.252081 0.199195 0.211989 0.214790 0.226928 0.215851
chargesum: 0.00000
title: Mulliken charges with hydrogens summed into heavy atoms:
elementType: O N N N N C C C C C C C C C C C C C C C C C C C C
charge: -0.323472 -0.065237 -0.143768 -0.104562 -0.161999 0.012382 0.066512 -0.033955 0.256833 -0.166984 -0.077772 0.492094 -0.201998 0.368254 0.228037 -0.004031 -0.262002 -0.183634 -0.149578 0.010870 0.284899 0.108360 0.040965 0.003286 0.006501
polarizability: 2.89509049e+02 1.12503923e+01 2.40489746e+02 -2.44359661e+01 2.60566604e+01 2.08626903e+02
1716.lowfreq: -9.2511 -3.4060 0.0002 0.0006 0.0006 3.3729 7.8777 23.1547 34.2108
frequency: 7.4367 23.0600 34.1033 53.3509 68.7828 75.7831 85.3393 104.2542 115.6279 145.5797 151.9653 176.4905 188.8546 209.1062 210.9780 227.4146 233.2802 246.4550 257.5661 280.8757 291.9869 315.5039 324.4141 337.2975 371.0927 392.1930 417.6490 421.9611 444.6722 459.5514 466.6142 476.5810 485.7721 492.1861 534.3628 548.8802 576.9840 583.9392 592.0472 605.9859 622.8904 647.4279 707.5099 711.5079 734.8902 754.7851 765.0161 776.3249 779.6929 792.9779 801.7809 807.3788 835.4749 876.2112 883.2272 894.0295 917.3110 926.8683 944.7889 953.6933 967.4011 983.6959 1022.1290 1035.0433 1043.3517 1049.0064 1069.7610 1072.3770 1079.8079 1088.1832 1095.1604 1096.5926 1105.5140 1109.8299 1120.5947 1127.7488 1148.9286 1171.8337 1174.3776 1185.1552 1186.8489 1213.7298 1219.0432 1220.3063 1233.4343 1242.7157 1254.9029 1270.1376 1273.4834 1287.5364 1298.0629 1303.3455 1309.9924 1317.4881 1330.6494 1339.1476 1343.2831 1348.7444 1356.9657 1362.3153 1369.6757 1378.9755 1386.3610 1394.6393 1405.1132 1416.9057 1434.4855 1450.1772 1453.1072 1457.9604 1463.3668 1464.4556 1467.3078 1473.9838 1478.7962 1480.4428 1482.0281 1483.6984 1494.1096 1498.3771 1500.6387 1563.2442 1596.7394 1616.3494 1627.7781 2791.3230 2867.2292 2963.8416 2973.8670 2979.0415 2979.6668 2981.1637 2982.9018 2990.6172 2996.5890 3008.1582 3022.9548 3027.7253 3034.2994 3046.7402 3061.9120 3063.2465 3067.9252 3076.9788 3081.8469 3084.9577 3099.9173 3119.0429 3133.3444 3154.0446 3216.7977 3552.0005 3612.0979
redmass: 3.7728 4.3770 4.5202 3.1256 3.1521 4.4926 4.3281 2.9724 3.4070 2.5780 3.2061 3.0250 1.8918 3.4351 1.1403 1.9749 1.2195 3.3629 1.7170 4.0183 3.1656 2.8369 2.8508 3.2400 3.0834 2.7579 3.4799 3.5364 2.2876 2.1149 3.4212 2.8116 2.8597 1.2651 3.1460 4.3260 3.7102 4.0198 3.3123 3.3424 4.1547 2.6507 9.8297 4.6197 4.3520 1.4900 1.6440 1.6418 1.1977 2.8407 2.4584 1.9691 4.5945 2.6829 1.4646 1.8720 2.3267 2.1893 2.2706 1.3877 2.6699 2.2426 2.8119 2.3739 2.4781 1.9937 2.4254 2.1064 1.8841 2.4767 1.7618 1.9602 1.8891 2.3432 2.1984 2.3589 1.6849 1.4237 1.3033 1.9228 1.8794 1.6144 1.9095 1.7115 1.8331 1.6016 1.4329 1.5811 1.4609 1.8743 1.5317 1.4028 1.3861 1.7760 1.3167 1.2965 2.2396 1.2982 1.4298 1.2874 1.4983 1.2177 1.2424 1.6409 2.8725 3.2260 1.1590 2.7004 1.0887 1.3314 1.0835 1.0474 1.0518 1.1073 1.1463 1.2339 1.0567 1.5529 1.0633 1.1124 3.3616 6.8028 5.8048 7.3334 7.9777 1.0705 1.0559 1.0660 1.0652 1.0419 1.0370 1.0552 1.0811 1.0655 1.0825 1.0733 1.0858 1.0962 1.1005 1.0900 1.0939 1.0981 1.1005 1.0997 1.0970 1.1007 1.1015 1.0861 1.0913 1.0984 1.0980 1.0761 1.0807
irintensity: 0.9181 0.6058 0.4969 0.0214 1.8299 3.1824 5.6789 1.8135 0.7559 1.7704 0.5555 3.7317 2.2478 7.5579 0.0506 1.4270 0.7908 1.2021 1.4216 2.5498 9.5893 0.6411 0.9579 18.7293 6.8940 12.0678 1.7357 17.4658 11.5284 55.0437 3.1966 1.4626 13.6614 96.6439 8.3894 1.0059 3.4829 3.8095 3.0369 5.4967 2.6165 1.4499 15.1732 7.6815 1.5917 72.2777 15.4068 36.3863 3.8351 0.9003 5.0859 9.9683 4.0047 6.4133 1.2032 3.7439 0.7164 4.6218 3.6698 0.7421 2.0730 2.5466 23.6000 13.6979 9.6682 56.1900 21.8637 16.7409 10.9922 12.1662 12.1479 21.5700 3.6923 16.9725 12.6554 17.8495 4.5073 20.5505 3.2795 18.7810 84.1209 0.9930 11.1693 9.1377 3.7485 24.5186 112.7908 74.6445 19.2311 7.6094 11.5704 38.1803 14.6520 5.5251 6.7733 15.0028 32.6031 0.5195 1.9344 12.7978 5.2082 23.8573 19.8352 45.2421 6.7525 6.6008 5.9885 14.8200 21.5414 19.2271 49.7164 13.5744 8.5046 2.1679 76.5875 126.9222 12.6682 355.1182 13.9778 31.3568 1.2654 2.2979 250.6286 15.4102 9.1886 98.1187 128.6231 25.6548 18.1555 8.1068 52.6431 35.4450 31.6362 44.6871 31.1241 60.0238 33.0094 40.7683 12.6167 11.2332 15.5361 16.9164 37.4093 56.5531 42.1437 34.0384 31.3503 3.7431 18.2748 36.5611 2.0470 4.4913 59.0903
temp: 298.150 k
press: 1.00000 atm
elementType: 8 7 7 7 7 6 6 6 6 6 6 6 6 6 6 6 6 6 6 6 6 6 6 6 6 1 1 1 1 1 1 1 1 1 1 1 1 1 1 1 1 1 1 1 1 1 1 1 1 1 1 1 1
symmnumber: 1
zpe: 1186918.9 jmol-1
zpe.correction: 0.452074 hartree
zpe.thermalcorrener: 0.476103 hartree
zpe.thermalcorrenthalpy: 0.477047 hartree
zpe.thermalcorrgfe: 0.396878 hartree
zpe.sumelectzpe: -1071.301283 hartree
zpe.sumelectthermal: -1071.277254 hartree
zpe.sumelectthermalent: -1071.276310 hartree
zpe.sumelectthermalfe: -1071.356479 hartree
dipole: -0.7783 1.9507 5.4389
dipole: 5.8303
quadrupole: -122.7282 -143.6968 -149.7537
quadrupole: 2.9448 3.0406 0.1983
quadrupole: 15.9981 -4.9706 -11.0275 2.9448 3.0406 0.1983
hfenergy: -1071.7533568 hartree
pointgroup: C01 [X(C20H28N4O1)]
dipole: 0.3346065 -0.6494892 2.1743646 debye
polarizability: 290.5403708|11.5460664|237.184144|22.1497901|-28.1432291|210.901184 unknown
InChI: InChI=1S/C20H28N4O/c1-4-24(5-2)20(25)22-14-10-16-15-7-6-8-17-19(15)13(11-21-17)9-18(16)23(3)12-14/h6-8,11,14,16,18,21-22H,4-5,9-10,12H2,1-3H3
charge 0 multiplicity 1
53 atoms
O  -3.428179 0.784821 -1.521594
N  0.371544 -2.610819 -0.828691
N  -2.54071 -0.466775 0.241349
N  5.013485 0.618925 1.44622
N  -4.63993 0.629137 0.476863
C  1.099246 -0.251124 -1.054805
C  1.520064 -1.694973 -0.609414
C  -0.183622 0.200314 -0.300495
C  -1.327477 -0.819831 -0.515629
C  2.130529 -1.760718 0.846307
C  -0.871685 -2.243683 -0.125913
C  2.238927 0.741678 -0.86832
C  3.18714 0.431939 0.131437
C  3.225369 -0.730694 0.979392
C  4.303344 1.269526 0.426617
C  0.694892 -4.044248 -0.743028
C  2.433953 1.942913 -1.577932
C  4.360809 -0.594255 1.775945
C  4.49652 2.480624 -0.279223
C  3.544481 2.793708 -1.277565
C  -3.529564 0.343322 -0.329166
C  -5.674327 1.532863 -0.073108
C  -4.875859 0.021659 1.799952
C  -6.812008 0.780492 -0.7976
C  -4.233952 0.804129 2.972409
H  0.83866 -0.323434 -2.129798
H  2.322633 -2.021916 -1.301705
H  0.033319 0.304892 0.782476
H  -0.507251 1.192051 -0.664574
H  -1.604395 -0.813209 -1.584128
H  2.506215 -2.783628 1.037594
H  1.329366 -1.574163 1.590614
H  -0.771048 -2.304297 0.993685
H  -1.659802 -2.964728 -0.412667
H  0.885719 -4.414948 0.294934
H  1.595227 -4.25516 -1.348323
H  -0.140875 -4.636471 -1.159432
H  -2.52683 -0.638619 1.24701
H  1.735451 2.23487 -2.371313
H  4.766355 -1.246966 2.54738
H  5.872104 0.952735 1.877683
H  5.339352 3.151472 -0.079487
H  3.665661 3.722067 -1.847901
H  -6.07896 2.141128 0.759458
H  -5.175221 2.211947 -0.784236
H  -5.969689 -0.027975 1.956714
H  -4.524521 -1.028962 1.795302
H  -6.405271 0.232496 -1.664368
H  -7.313939 0.057238 -0.127741
H  -7.575197 1.493063 -1.162633
H  -3.134841 0.865438 2.870866
H  -4.620163 1.83846 3.004913
H  -4.465547 0.319588 3.939369
