program: Gaussian 09
title: 000005336
version: EM64L-G09RevD.01
frameworkgroup: C1[X(C11H11N3O2S)]
method: RPBEPBE
basis: SDD
operation: Freq
keyword: #p
keyword: freq=noraman
keyword: PBEPBE/SDD
title: #p freq=noraman PBEPBE/SDD
converged: YES YES NO NO
title: Mulliken charges:
elementType: S O O N N N C C C C C C C C C C C H H H H H H H H H H H
charge: 0.969949 -0.554292 -0.495076 -0.631861 -0.066514 -0.688928 -0.089477 -0.226153 -0.141983 0.280964 0.517138 -0.392808 -0.410641 -0.326758 -0.149293 -0.198113 -0.321488 0.334138 0.284884 0.285882 0.229881 0.228948 0.229976 0.238424 0.313704 0.314089 0.231446 0.233959
chargesum: 0.00000
title: Mulliken charges with hydrogens summed into heavy atoms:
elementType: S O O N N N C C C C C C C C C C C
charge: 0.969949 -0.554292 -0.495076 -0.297723 -0.066514 -0.061135 -0.089477 0.058731 0.143900 0.280964 0.517138 -0.162926 -0.181693 -0.096782 0.089132 0.033333 -0.087528
polarizability: 2.43311353e+02 -2.65560508e+00 1.80530722e+02 -5.95723001e+00 -2.33781268e+01 1.16947350e+02
1716.lowfreq: -12.4242 -10.4492 0.0005 0.0016 0.0022 5.7460 21.3612 37.2222 57.1337
frequency: 20.8274 37.1453 57.1163 74.8474 92.1387 136.8338 160.1979 189.4272 219.4516 234.4069 249.9287 299.4745 324.6523 402.1296 402.7214 410.0844 411.1146 412.4673 424.7373 439.9220 455.3150 513.6433 518.4866 582.6178 603.6924 620.8986 623.5191 699.9628 720.0743 737.5621 773.7721 799.3622 809.4688 813.9397 833.4560 852.5012 865.0287 943.7005 945.3221 947.1949 957.1927 966.1183 981.3044 982.8837 1023.0848 1038.8317 1050.8377 1094.1388 1132.4020 1164.8427 1185.4971 1202.3416 1302.6644 1311.6339 1320.9889 1322.4762 1345.8719 1400.8151 1417.3307 1434.3047 1454.3718 1488.9927 1554.6515 1581.7098 1587.0719 1613.1007 1649.1696 3130.0082 3134.5187 3137.1620 3137.2630 3155.9455 3165.3764 3178.1399 3179.6646 3486.4834 3563.0378 3702.3706
redmass: 5.0386 4.1847 4.4374 6.6894 6.3551 7.3846 5.7212 5.8957 9.6035 8.8623 7.9548 6.2584 5.8801 5.3379 3.1304 3.9658 1.0598 2.6349 1.5543 4.2800 1.6063 2.8033 2.6838 6.4562 7.0690 6.5357 6.4520 2.9123 2.8882 1.8756 2.1959 5.7007 1.3414 8.0252 1.8013 5.2629 1.3408 1.5807 5.3454 1.4671 6.6969 1.3735 5.0723 1.3304 1.4342 2.2852 2.5274 1.6100 1.1972 1.0714 1.1180 1.3935 1.2973 1.8614 3.1617 3.2599 2.1151 5.7740 2.2033 3.6399 2.3617 2.8816 5.7122 5.8661 7.3833 4.8802 1.2191 1.0887 1.0895 1.0894 1.0891 1.0953 1.0956 1.1005 1.0951 1.0775 1.0452 1.1040
irintensity: 1.4718 1.8908 2.9004 0.0374 0.5158 0.6498 2.2394 1.1156 1.0156 9.7310 5.9774 22.6668 9.3833 29.4355 4.2793 2.9210 0.1087 0.4139 172.0432 301.7823 72.3208 13.9205 39.9154 32.1500 33.0507 1.6525 4.4758 190.8224 5.4081 58.3948 54.4736 52.5867 3.1379 87.8343 85.1815 31.0854 1.1290 9.0458 42.9038 5.7788 19.1478 0.9724 7.3621 0.3039 1.5117 5.7128 58.2444 6.1124 12.5527 6.5912 54.5576 9.3698 5.3076 17.7271 106.4632 44.9380 19.1749 3.1789 85.8280 4.9177 142.4503 74.4566 14.7166 150.3080 19.4158 173.0973 260.2139 16.2666 15.0426 6.6449 11.6333 21.3185 7.1826 22.4426 7.3835 40.3814 110.1789 24.7614
temp: 298.150 k
press: 1.00000 atm
elementType: 16 8 8 7 7 7 6 6 6 6 6 6 6 6 6 6 6 1 1 1 1 1 1 1 1 1 1 1
symmnumber: 1
zpe: 539478.4 jmol-1
zpe.correction: 0.205476 hartree
zpe.thermalcorrener: 0.221430 hartree
zpe.thermalcorrenthalpy: 0.222374 hartree
zpe.thermalcorrgfe: 0.160750 hartree
zpe.sumelectzpe: -1137.141865 hartree
zpe.sumelectthermal: -1137.125912 hartree
zpe.sumelectthermalent: -1137.124967 hartree
zpe.sumelectthermalfe: -1137.186592 hartree
dipole: 2.1753 -5.8964 -3.3110
dipole: 7.1037
quadrupole: -65.1395 -106.6266 -110.4049
quadrupole: -10.8251 0.8652 -10.9254
quadrupole: 28.9175 -12.5696 -16.3479 -10.8251 0.8652 -10.9254
hfenergy: -1137.3473416 hartree
pointgroup: C01 [X(C11H11N3O2S1)]
dipole: -1.0394964 -2.5688354 0.3625699 debye
polarizability: 241.9669016|-5.157079|160.3860555|13.2262524|37.4647279|138.436468 unknown
InChI: InChI=1S/C11H11N3O2S/c12-9-4-6-10(7-5-9)17(15,16)14-11-3-1-2-8-13-11/h1-8,14H,12H2
charge 0 multiplicity 1
28 atoms
S  -0.007096 1.735603 0.218786
O  -0.484936 2.908589 1.24622
O  0.728595 2.104338 -1.177563
N  1.144353 0.790723 1.364471
N  1.725614 -0.840147 -0.236357
N  -4.789898 -1.801775 -0.843536
C  -1.446935 0.603058 -0.091108
C  -2.567733 0.733171 0.748733
C  -1.395157 -0.294351 -1.172017
C  2.065172 -0.151377 0.896093
C  -3.680648 -1.003349 -0.592471
C  -3.688043 -0.075814 0.494502
C  -2.519948 -1.096918 -1.422053
C  3.269756 -0.405971 1.61931
C  4.122231 -1.425374 1.158316
C  3.78163 -2.146891 -0.012773
C  2.580975 -1.806714 -0.672522
H  1.408661 1.42517 2.12998
H  -2.562931 1.464866 1.562753
H  -0.489956 -0.364181 -1.781092
H  -4.575189 0.009652 1.132335
H  -2.506102 -1.804279 -2.259084
H  3.518468 0.17776 2.511644
H  5.049294 -1.645349 1.698517
H  -5.620729 -1.739674 -0.262083
H  -4.795626 -2.458153 -1.619032
H  4.426966 -2.936786 -0.406631
H  2.27991 -2.324227 -1.590735
