program: Gaussian 09
title: 000040891
version: EM64L-G09RevD.01
frameworkgroup: C1[X(C16H20N2O5)]
method: RPBEPBE
basis: SDD
operation: Freq
keyword: #p
keyword: freq=noraman
keyword: PBEPBE/SDD
title: #p freq=noraman PBEPBE/SDD
converged: YES YES NO NO
title: Mulliken charges:
elementType: O O O O O N N C C C C C C C C C C C C C C C C H H H H H H H H H H H H H H H H H H H H
charge: -0.193496 -0.219148 -0.203034 -0.205682 -0.220960 -0.373742 -0.365378 0.183005 -0.513004 -0.584247 0.182311 0.173981 0.327031 0.501989 -0.683281 -0.708068 -0.679487 0.169757 -0.392621 -0.431158 -0.234509 -0.224111 -0.242390 0.239847 0.283936 0.233141 0.267418 0.367007 0.367247 0.228751 0.202924 0.240418 0.231668 0.234947 0.215221 0.242096 0.202432 0.229036 0.234607 0.238391 0.224656 0.224539 0.227962
chargesum: 0.00000
title: Mulliken charges with hydrogens summed into heavy atoms:
elementType: O O O O O N N C C C C C C C C C C C C C C C C
charge: -0.193496 -0.219148 -0.203034 -0.205682 -0.220960 -0.006735 0.001868 0.183005 0.010779 -0.083689 0.182311 0.173981 0.327031 0.501989 -0.011188 -0.026233 -0.005922 0.169757 -0.158015 -0.192767 -0.009853 0.000428 -0.014427
polarizability: 2.56057882e+02 7.38442723e+00 1.94774168e+02 -1.44284438e+00 -1.84995309e+01 1.72593735e+02
1716.lowfreq: -7.9284 -1.6842 -0.0007 -0.0003 -0.0001 2.1910 12.2780 14.5910 24.6080
frequency: 8.0536 14.3247 24.4889 25.4166 33.3105 49.7836 68.3434 105.7555 120.2874 131.4956 140.1115 154.2481 156.7134 173.7295 194.0270 217.6315 225.1861 234.8333 291.0076 309.8133 323.2573 330.8939 343.8827 351.5099 362.5316 374.2415 402.9938 423.0626 441.9460 461.0700 474.8671 500.1717 510.6649 564.8740 604.8340 617.3173 639.3198 649.5429 679.1581 703.5452 713.2204 730.0306 754.0708 758.4566 765.2052 778.3944 793.5439 800.1264 817.9474 840.7011 854.0494 912.2531 917.0847 919.4427 921.2536 951.8774 976.1724 979.5238 990.1457 993.9518 995.2660 1023.0023 1024.9652 1026.5370 1029.9179 1037.3613 1080.3406 1098.0215 1171.8571 1181.9558 1186.9039 1191.0934 1217.1127 1226.9668 1253.4351 1261.1689 1280.6571 1300.7969 1309.0941 1326.5457 1353.6842 1364.4498 1371.8952 1377.2099 1380.2123 1382.1096 1382.8756 1398.6633 1440.2513 1443.0582 1453.5984 1462.0382 1465.4261 1469.6529 1470.5578 1482.1757 1487.2759 1495.8069 1592.6614 1613.7625 1623.1805 1656.7136 1677.5349 2991.8102 2992.2232 2992.9474 2997.9965 3021.1175 3057.7429 3089.3224 3090.8790 3091.6938 3098.8723 3099.7304 3105.6234 3110.0358 3113.0249 3116.6715 3131.5140 3143.2533 3161.9250 3514.6750 3517.6348
redmass: 3.9460 7.5330 4.0914 4.4455 3.3064 5.0010 4.4915 3.5124 2.1409 5.3021 6.6286 1.5742 4.5830 5.5765 5.6416 1.0730 1.3568 1.6437 3.8712 7.1194 2.6200 3.2250 2.9693 4.4049 9.4274 6.4196 2.8204 4.1215 3.1270 3.0622 9.1805 3.7128 4.2729 6.3392 6.3751 6.3655 3.5347 4.0481 2.5569 2.2553 3.6915 3.5833 1.8095 2.6525 2.4760 1.6064 1.7837 4.1200 3.7691 5.2836 1.2499 1.6037 1.7808 1.5767 1.9624 1.2054 1.4041 4.9407 6.1135 1.6176 2.3856 1.4169 1.5386 2.1886 4.1372 2.5461 3.0677 1.7264 1.0557 1.9197 1.1529 1.8618 2.6653 2.9345 3.0604 3.0307 1.4417 2.1861 1.7742 1.2665 1.4231 7.4723 1.2157 1.2321 2.1313 2.5144 2.2730 1.2068 2.1580 1.0478 1.0823 1.0522 1.0478 1.0575 1.0577 1.8260 1.2565 1.0558 6.0299 6.1496 7.0866 10.0069 5.1753 1.0607 1.0348 1.0355 1.0361 1.0613 1.0997 1.0998 1.1021 1.0998 1.0994 1.1005 1.1002 1.0994 1.0874 1.0868 1.0908 1.0958 1.1015 1.0760 1.0777
irintensity: 0.1398 0.3887 0.4667 1.1332 0.4063 0.1954 0.0236 0.3431 0.2517 0.6589 0.8175 0.9578 10.8066 2.5702 0.8124 0.0831 0.5123 0.8344 5.7969 1.3390 1.5529 3.4777 5.9824 1.5925 23.8169 4.8856 0.0029 5.1767 4.9873 1.3400 13.4980 31.0651 10.4737 7.8656 3.1488 0.0399 2.1714 1.0544 20.6033 28.6687 38.1673 9.8559 6.0411 5.6971 38.3857 19.4216 209.8007 16.3980 3.8203 5.9937 0.0356 0.5005 4.1727 1.2474 9.8589 0.0190 0.1040 14.2267 0.5539 0.0885 3.8345 0.2525 8.1823 9.2715 15.0589 10.9569 4.3250 5.6790 0.2769 132.4679 5.7884 15.8620 3.7945 47.5724 23.4595 13.1219 73.3904 148.2836 161.9367 1.0748 11.2767 254.6950 27.9665 28.3220 0.8432 1.1436 0.1971 18.4827 8.0443 0.6602 3.4751 2.1196 1.4077 9.4161 6.5737 26.7214 7.6677 22.5138 2.9226 11.8037 249.7360 63.6872 655.2760 7.1580 15.3749 15.6789 20.5056 14.5286 2.6461 3.8036 7.1089 7.9315 49.8779 21.3594 22.6833 27.8086 9.5665 5.4347 9.6081 41.3898 28.0729 76.2757 50.3976
temp: 298.150 k
press: 1.00000 atm
elementType: 8 8 8 8 8 7 7 6 6 6 6 6 6 6 6 6 6 6 6 6 6 6 6 1 1 1 1 1 1 1 1 1 1 1 1 1 1 1 1 1 1 1 1
symmnumber: 1
zpe: 891888.9 jmol-1
zpe.correction: 0.339703 hartree
zpe.thermalcorrener: 0.363135 hartree
zpe.thermalcorrenthalpy: 0.364079 hartree
zpe.thermalcorrgfe: 0.282458 hartree
zpe.sumelectzpe: -1105.578894 hartree
zpe.sumelectthermal: -1105.555462 hartree
zpe.sumelectthermalent: -1105.554518 hartree
zpe.sumelectthermalfe: -1105.636140 hartree
dipole: 0.4582 -1.2396 0.2901
dipole: 1.3531
quadrupole: -125.5042 -134.3923 -141.8138
quadrupole: -13.2422 -2.5875 -2.6393
quadrupole: 8.3992 -0.4888 -7.9104 -13.2422 -2.5875 -2.6393
hfenergy: -1105.918597 hartree
pointgroup: C01 [X(C16H20N2O5)]
dipole: -0.19322 -0.4796948 -0.1262936 debye
polarizability: 255.63337|-8.4009374|193.9405065|-2.6237583|19.3410892|173.8519088 unknown
InChI: InChI=1S/C16H20N2O5/c1-15(2,3)22-23-16(10-9-11-7-5-4-6-8-11)12(19)17-14(21)18-13(16)20/h4-8,17-18H,9-10H2,1-3H3
charge 0 multiplicity 1
43 atoms
O  -1.000705 -0.990035 0.166717
O  -2.546037 -0.854938 0.352528
O  -0.414899 0.899733 2.357767
O  -1.180713 0.3226 -2.44354
O  -2.998233 3.884871 -0.081424
N  -1.650536 2.37331 1.083873
N  -2.038886 2.092266 -1.23191
C  -0.583698 0.390919 -0.054777
C  0.949539 0.316855 -0.346319
C  1.769185 -0.53915 0.658508
C  -0.868525 1.213742 1.231034
C  -1.290846 0.91032 -1.341081
C  -3.133656 -2.229532 0.219756
C  3.242732 -0.533033 0.274484
C  -2.571147 -3.139125 1.328875
C  -4.629488 -1.908069 0.441437
C  -2.865839 -2.780536 -1.193692
C  -2.282861 2.853243 -0.075644
C  3.713319 -1.326652 -0.804609
C  4.171441 0.286088 0.966115
C  5.073897 -1.30318 -1.182887
C  5.534469 0.313705 0.591028
C  5.990175 -0.480286 -0.48647
H  1.34975 1.349657 -0.366732
H  1.057144 -0.09723 -1.36535
H  1.369279 -1.568965 0.649641
H  1.629087 -0.148718 1.680008
H  -1.828171 2.915432 1.936333
H  -2.493355 2.431984 -2.086206
H  -2.761423 -2.701098 2.323787
H  -3.049514 -4.134161 1.281562
H  -1.482664 -3.270115 1.210564
H  -5.005027 -1.217235 -0.33296
H  -4.793693 -1.455785 1.434503
H  -5.20887 -2.846641 0.383335
H  -1.784911 -2.916985 -1.36123
H  -3.368187 -3.756727 -1.320428
H  -3.244555 -2.083805 -1.961172
H  3.010132 -1.974318 -1.34409
H  3.824379 0.897836 1.808275
H  5.420742 -1.926559 -2.014985
H  6.239146 0.948687 1.140146
H  7.046622 -0.462368 -0.777068
