program: Gaussian 09
title: 000005457
version: EM64L-G09RevD.01
frameworkgroup: C1[X(C16H22N4O)]
method: RPBEPBE
basis: SDD
operation: Freq
keyword: #p
keyword: freq=noraman
keyword: PBEPBE/SDD
title: #p freq=noraman PBEPBE/SDD
converged: YES YES NO NO
title: Mulliken charges:
elementType: O N N N N C C C C C C C C C C C C C C C C H H H H H H H H H H H H H H H H H H H H H H
charge: -0.266221 -0.095716 -0.083701 -0.090104 -0.066633 -0.354489 -0.378734 -0.606214 0.548672 0.099047 -0.621048 -0.613674 -0.456554 -0.355888 -0.354801 -0.357482 0.319546 -0.297671 -0.292495 -0.196340 -0.538176 0.249674 0.207221 0.212032 0.253366 0.275337 0.221768 0.187701 0.232533 0.217770 0.218159 0.192111 0.220367 0.226231 0.254637 0.239006 0.249345 0.241477 0.241562 0.232670 0.219560 0.245361 0.220788
chargesum: 0.00000
title: Mulliken charges with hydrogens summed into heavy atoms:
elementType: O N N N N C C C C C C C C C C C C C C C C
charge: -0.266221 -0.095716 -0.083701 -0.090104 -0.066633 0.102406 0.086664 -0.109110 0.548672 0.099047 0.016956 0.016963 -0.230323 -0.101251 -0.115796 -0.108137 0.319546 -0.056194 -0.050933 0.036330 0.147533
polarizability: 2.83747102e+02 2.40100215e+01 1.83128369e+02 1.86048277e+01 1.26004357e+01 1.59628605e+02
1716.lowfreq: -8.4530 -4.4187 -0.0004 0.0000 0.0005 2.5177 14.1999 19.8409 35.0761
frequency: 13.8750 19.8185 35.0088 35.8171 47.4553 59.9622 85.2707 100.1718 123.7465 147.5518 155.7352 179.8932 205.3707 214.2303 240.5592 242.6377 256.4903 299.3264 313.3273 338.0575 359.3668 375.6916 408.6658 411.8808 424.7007 436.8237 440.3294 502.9379 517.0373 528.0433 566.3128 607.1076 627.6044 633.9076 704.8544 740.4546 763.3032 774.9633 783.0447 794.0115 809.7819 818.6486 827.6495 845.2691 924.6373 936.4696 950.0196 955.3071 964.1578 972.6096 988.6302 999.1951 1008.7749 1022.1590 1035.1751 1051.8353 1056.7494 1072.2310 1082.2038 1090.5040 1112.1364 1114.1806 1135.4013 1148.9449 1156.4910 1176.6074 1190.6220 1214.3564 1227.2966 1236.4149 1259.3114 1266.8092 1279.9463 1296.7697 1306.1977 1309.9910 1325.0006 1356.3854 1370.7821 1379.5438 1388.2559 1404.4948 1417.7028 1418.7885 1436.2021 1437.7840 1446.1692 1459.9617 1466.9689 1468.6200 1469.7791 1473.4114 1474.4343 1483.7960 1487.2432 1501.1971 1504.9474 1517.2941 1567.7670 1585.2379 1623.1156 2847.9743 2858.5820 2897.3120 2957.9993 2986.7486 3015.0501 3017.4982 3020.6894 3044.6581 3051.8384 3070.8125 3075.3705 3079.4545 3089.6204 3113.2943 3124.6141 3124.7051 3125.4026 3134.1994 3159.0187 3166.0549 3187.1753
redmass: 4.2638 3.8470 3.2345 3.2219 4.1649 4.2539 3.8350 2.9936 4.0942 4.8869 3.6407 3.0088 2.1229 1.1860 1.3402 1.2703 2.8114 3.2329 3.3024 5.1439 3.0546 2.0491 4.0898 3.0192 2.6392 3.9289 2.4478 3.0625 3.4040 3.5848 3.5901 4.3678 7.7161 6.3532 3.8348 4.6599 2.9919 1.7978 1.3872 3.0154 2.4342 1.7878 3.4461 1.8086 1.8366 3.7279 2.0579 1.3736 1.4539 1.3854 8.3744 2.6938 2.3739 2.6769 1.5595 2.5648 2.6793 1.7780 1.7671 1.3734 1.2608 1.3511 1.5522 1.9841 1.3398 1.2384 2.0764 2.4847 4.1096 2.6390 1.6415 2.5489 2.0755 1.6741 1.2442 1.3368 1.3436 1.3581 1.3330 1.6915 4.0644 1.8196 3.1650 1.1590 1.1702 1.1567 1.1726 1.0500 1.0504 1.0613 1.1298 1.0671 1.0599 1.0842 1.0641 2.4482 5.5544 3.1847 5.4411 6.8634 6.3520 1.0569 1.0574 1.0689 1.0331 1.0655 1.0730 1.0636 1.0683 1.1038 1.0894 1.0963 1.1003 1.1001 1.1044 1.0893 1.0965 1.0928 1.0926 1.0893 1.0934 1.0958 1.0981
irintensity: 0.2519 0.3237 0.2243 0.9227 0.4280 0.4283 3.1950 0.7703 5.1525 1.7989 2.2179 2.4437 1.4124 1.3455 1.8567 0.7668 1.7856 4.1351 2.3145 1.2103 16.9199 3.5064 0.1534 1.2784 0.4262 3.2240 4.1166 6.7587 8.7088 7.3717 35.6042 11.1322 1.2639 1.2022 2.2033 3.8221 3.8275 19.9267 35.9223 45.9754 22.9610 9.8588 4.2603 42.2108 9.7995 10.5778 45.7382 0.2146 0.6240 3.0460 34.4691 26.4861 3.2607 18.1134 20.8393 4.4663 26.3586 1.4771 5.2452 10.7088 0.1874 15.3560 9.5824 12.8673 0.6182 84.4310 1.3432 4.7785 207.5984 3.7037 19.3120 13.4281 1.7176 32.6330 6.7915 8.6357 2.9243 28.4940 10.1894 60.8723 92.5022 1.2179 2.5256 9.0826 9.2518 30.1170 38.7154 9.4924 12.9781 16.3082 45.7564 55.0441 21.7405 14.7112 7.0270 66.1531 78.1202 240.7784 563.8284 17.5604 38.3385 67.9088 152.1737 90.1344 71.1908 48.4785 42.6247 4.2979 90.5863 49.7516 4.9337 11.8388 19.1714 61.4973 25.1187 19.0165 35.4223 15.6181 29.3057 6.4941 16.7939 4.4935 18.7193
temp: 298.150 k
press: 1.00000 atm
elementType: 8 7 7 7 7 6 6 6 6 6 6 6 6 6 6 6 6 6 6 6 6 1 1 1 1 1 1 1 1 1 1 1 1 1 1 1 1 1 1 1 1 1 1
symmnumber: 1
zpe: 938899.8 jmol-1
zpe.correction: 0.357608 hartree
zpe.thermalcorrener: 0.378676 hartree
zpe.thermalcorrenthalpy: 0.379620 hartree
zpe.thermalcorrgfe: 0.304516 hartree
zpe.sumelectzpe: -915.514085 hartree
zpe.sumelectthermal: -915.493017 hartree
zpe.sumelectthermalent: -915.492073 hartree
zpe.sumelectthermalfe: -915.567176 hartree
dipole: 1.8649 0.4988 0.2703
dipole: 1.9493
quadrupole: -102.0373 -128.0660 -123.0115
quadrupole: 9.4131 10.9505 -0.0655
quadrupole: 15.6676 -10.3610 -5.3066 9.4131 10.9505 -0.0655
hfenergy: -915.8716926 hartree
pointgroup: C01 [X(C16H22N4O1)]
dipole: 0.6543163 -0.3920079 -0.0796557 debye
polarizability: 263.8023481|-47.1597538|206.3531985|-13.219226|11.7628183|156.3485294 unknown
InChI: InChI=1S/C16H22N4O/c1-19(2)11-12-20(16-17-9-4-10-18-16)13-14-5-7-15(21-3)8-6-14/h4-10H,11-13H2,1-3H3
charge 0 multiplicity 1
43 atoms
O  4.840974 -0.030703 0.922302
N  -1.377681 0.195375 -0.957877
N  -1.107018 -3.27768 0.609191
N  -2.103507 2.411977 -0.541125
N  -3.368327 0.470188 0.278426
C  -1.525442 -1.270142 -0.813635
C  -1.102977 -1.796851 0.582379
C  -0.226561 0.719094 -1.734803
C  1.121873 0.49354 -1.059667
C  -2.30182 1.048175 -0.394195
C  -1.448276 -3.840477 1.930282
C  0.127739 -3.870637 0.05935
C  2.088033 -0.370342 -1.62004
C  1.439198 1.161655 0.155404
C  3.343328 -0.581128 -0.999918
C  2.678572 0.967145 0.786759
C  3.636282 0.091703 0.210535
C  -3.048355 3.222551 -0.000593
C  -4.28503 1.326431 0.798876
C  -4.183772 2.733526 0.688302
C  5.867081 -0.91397 0.365303
H  -2.577489 -1.554228 -0.981808
H  -0.906128 -1.738812 -1.599518
H  -0.107384 -1.371957 0.856148
H  -1.841008 -1.423348 1.313409
H  -0.411847 1.796985 -1.874824
H  -0.232006 0.229236 -2.728351
H  -0.684829 -3.623601 2.720627
H  -2.41712 -3.433531 2.268693
H  -1.548812 -4.93888 1.850944
H  0.324786 -3.478148 -0.953557
H  1.031631 -3.658042 0.686146
H  0.012249 -4.967054 -0.01939
H  1.865385 -0.890158 -2.560916
H  0.703509 1.84208 0.599871
H  4.068441 -1.256966 -1.463266
H  2.934203 1.480288 1.718966
H  -2.878722 4.298847 -0.124406
H  -5.125532 0.85814 1.325157
H  -4.932178 3.402648 1.117701
H  5.507533 -1.959648 0.299095
H  6.709478 -0.856301 1.070146
H  6.194524 -0.571379 -0.635925
