program: Gaussian 09
title: 000005452
version: EM64L-G09RevD.01
frameworkgroup: C1[X(C21H26N2S2)]
method: RPBEPBE
basis: SDD
operation: Freq
keyword: #p
keyword: freq=noraman
keyword: PBEPBE/SDD
title: #p freq=noraman PBEPBE/SDD
converged: NO YES NO NO
title: Mulliken charges:
elementType: S S N N C C C C C C C C C C C C C C C C C C C C C H H H H H H H H H H H H H H H H H H H H H H H H H H
charge: 0.218528 0.167023 -0.076903 -0.229824 -0.047506 -0.437310 -0.459583 -0.419560 -0.385200 -0.374436 -0.531461 -0.645685 0.550281 0.498937 -0.381407 -0.342337 -0.293941 -0.319027 -0.268955 -0.274732 -0.257719 -0.267397 -0.265908 -0.252857 -0.841387 0.203120 0.212654 0.199690 0.245660 0.240912 0.214214 0.203323 0.185566 0.204253 0.197005 0.202625 0.253762 0.241721 0.216768 0.226959 0.191728 0.263348 0.243946 0.245828 0.243968 0.227295 0.257739 0.233045 0.263793 0.265937 0.253505
chargesum: 0.00000
title: Mulliken charges with hydrogens summed into heavy atoms:
elementType: S S N N C C C C C C C C C C C C C C C C C C C C C
charge: 0.218528 0.167023 -0.076903 -0.229824 0.155615 -0.024966 0.026989 -0.002023 0.004619 0.025195 -0.035978 -0.010230 0.550281 0.498937 -0.381407 -0.342337 -0.030592 -0.075080 -0.023127 -0.030764 -0.257719 -0.040102 -0.008169 -0.019812 -0.058153
polarizability: 3.12841256e+02 4.09863265e+01 3.73177488e+02 8.62541117e+00 1.54470884e+00 1.65594848e+02
1716.lowfreq: -19.9792 -6.8972 -5.3888 -0.0024 -0.0011 0.0012 4.1517 13.9604 19.7104
frequency: -14.9024 13.5593 18.7139 27.7543 47.4272 66.2374 85.9607 109.1401 124.4457 130.4760 131.5030 152.1481 169.7340 192.4836 212.5742 224.5337 235.7667 267.6816 270.6264 310.0793 315.3707 327.3604 330.2201 365.7028 379.5444 387.3052 409.6636 414.5867 423.2013 441.2612 454.0512 460.5540 475.1927 517.0321 518.5565 541.0508 590.1517 596.0299 606.5089 633.4853 642.2010 663.4409 689.6521 714.8943 721.0125 738.8841 748.4676 770.0601 786.3667 812.7921 814.5759 836.7313 840.9598 862.9117 866.2770 888.8739 912.1248 923.6950 938.4298 947.3200 962.7282 967.3671 985.9270 997.4766 1002.6661 1022.7436 1032.3949 1034.8336 1038.7250 1052.5260 1062.9439 1087.2642 1097.6885 1101.4994 1115.4772 1121.8118 1128.9838 1141.6522 1144.5748 1155.1598 1178.2809 1182.3568 1197.3804 1238.1185 1247.1197 1252.5864 1268.1913 1279.9464 1283.9644 1285.5989 1292.1922 1320.3833 1330.3410 1338.1864 1339.5117 1344.5844 1351.4713 1354.7037 1361.4173 1366.5206 1372.4817 1380.6869 1395.0115 1428.1248 1430.9649 1442.7611 1454.1100 1458.2236 1459.8502 1461.1171 1466.5006 1471.2577 1478.5674 1483.7193 1492.7797 1495.8739 1505.0995 1554.2990 1572.7529 1579.6109 1607.3537 2843.8745 2864.3244 2943.7355 2977.0800 2986.4560 2992.6438 2997.2345 3005.1046 3008.2438 3014.4199 3016.0968 3033.5431 3045.4919 3048.3628 3055.5713 3063.4869 3070.0885 3132.1019 3133.1427 3133.2901 3139.4807 3141.6088 3165.8851 3166.8355 3181.6158 3191.1456
redmass: 3.6709 3.0983 4.7348 6.1314 4.6902 5.2507 3.6543 3.2610 1.7542 2.5045 2.2886 2.8168 4.6806 2.6730 2.9976 1.4551 3.6183 2.9434 5.9761 5.6391 5.2572 2.3289 2.5132 4.4505 3.2183 2.9011 3.3746 3.7172 3.9916 4.1139 3.2326 3.4948 3.8219 2.9233 5.3911 3.7013 2.7503 3.5212 5.5313 4.5413 6.9351 6.1932 6.1452 3.6046 3.3442 2.9498 1.4024 2.4242 2.2210 1.5470 1.3256 2.3122 1.3945 1.5779 2.2344 1.8343 2.2924 1.3814 1.3507 2.4349 1.1726 1.3125 1.2799 2.1526 2.7214 5.8888 1.8817 5.6924 2.2368 2.1746 2.1693 4.0374 1.5768 1.8131 1.2715 1.8618 1.6270 2.0887 1.4504 2.3406 1.0851 1.6170 1.4070 2.2596 1.5398 1.5614 1.3534 1.5040 1.3138 1.4221 1.5413 1.3506 1.7469 1.1374 1.3903 1.4960 1.4044 1.3118 1.4969 4.5272 1.4272 7.4285 3.2335 2.3361 1.1533 1.0577 1.0912 2.1221 1.1695 1.0747 1.1053 1.1159 2.3105 1.0714 1.1026 1.0732 1.0859 6.4448 7.4979 6.6610 7.2288 1.0697 1.0578 1.0831 1.0608 1.0625 1.0625 1.0622 1.0723 1.0278 1.0605 1.0864 1.0962 1.1014 1.0983 1.1033 1.1004 1.1029 1.1058 1.1040 1.0855 1.0887 1.0911 1.0965 1.0964 1.0954 1.0900
irintensity: 0.0626 1.8368 0.1094 0.2880 0.3508 0.8846 0.2710 0.1423 0.6538 1.6170 1.0373 0.6810 0.2385 0.9767 0.3896 0.7654 1.6030 1.7674 0.6106 1.7314 0.4616 2.6996 2.5325 0.6233 1.0318 1.8173 1.1427 2.0645 1.1184 2.0974 0.4873 8.9563 10.3399 5.2364 7.2075 2.0729 10.6264 8.2168 2.5464 3.4410 0.9149 3.3926 1.0418 2.0394 5.3802 2.6640 90.3397 2.9855 5.2308 1.2485 33.7795 9.6920 0.7374 17.3058 3.3039 15.3319 11.7539 2.0310 0.1117 10.5023 5.7207 0.0164 29.6269 21.7524 3.3479 32.6724 31.4322 0.8225 35.5870 3.2553 3.8049 23.3863 5.9712 22.8339 3.3135 6.9310 23.6411 7.4073 13.9265 4.1198 2.5089 31.5501 26.3907 39.7666 25.4291 7.2189 1.7609 29.0381 9.0525 25.6147 29.5208 3.2347 45.6010 1.4960 1.0567 1.5667 6.2760 3.6396 21.7026 14.3446 2.3639 20.4859 75.8669 14.7452 9.8199 18.7431 6.6994 264.9245 121.8464 8.2289 28.6180 6.7005 35.0744 3.9859 2.9120 8.6506 17.2962 6.0104 61.7573 4.8048 42.8901 48.8994 136.6042 32.0647 25.3908 26.9994 24.3290 40.0616 53.5767 35.2868 34.3270 63.4972 47.4867 25.7739 13.8771 95.6371 42.5431 40.4733 16.9992 13.9014 0.6927 4.1395 10.5422 30.6756 6.3763 13.4758 2.4479
temp: 298.150 k
press: 1.00000 atm
elementType: 16 16 7 7 6 6 6 6 6 6 6 6 6 6 6 6 6 6 6 6 6 6 6 6 6 1 1 1 1 1 1 1 1 1 1 1 1 1 1 1 1 1 1 1 1 1 1 1 1 1 1
symmnumber: 1
zpe: 1109576.2 jmol-1
zpe.correction: 0.422615 hartree
zpe.thermalcorrener: 0.445920 hartree
zpe.thermalcorrenthalpy: 0.446864 hartree
zpe.thermalcorrgfe: 0.368195 hartree
zpe.sumelectzpe: -1719.589787 hartree
zpe.sumelectthermal: -1719.566482 hartree
zpe.sumelectthermalent: -1719.565538 hartree
zpe.sumelectthermalfe: -1719.644208 hartree
dipole: 1.1950 -0.7945 1.0977
dipole: 1.8067
quadrupole: -164.5248 -151.3691 -169.0626
quadrupole: 0.4713 3.3966 7.4394
quadrupole: -2.8726 10.2831 -7.4105 0.4713 3.3966 7.4394
hfenergy: -1720.0124024 hartree
pointgroup: C01 [X(C21H26N2S2)]
dipole: 0.4012783 0.4220184 -0.4075563 debye
polarizability: 332.7233914|-49.4941865|353.3381597|-7.7676632|6.5519947|165.5520396 unknown
InChI: InChI=1S/C21H26N2S2/c1-22-13-6-5-7-16(22)12-14-23-18-8-3-4-9-20(18)25-21-11-10-17(24-2)15-19(21)23/h3-4,8-11,15-16H,5-7,12-14H2,1-2H3
charge 0 multiplicity 1
51 atoms
S  -3.821961 -1.271067 -0.392261
S  1.912579 -4.147086 0.515914
N  3.188297 2.832191 0.469109
N  -1.007452 0.118429 -0.586492
C  2.39318 2.094053 -0.5521
C  3.365515 1.258471 -1.427381
C  1.220342 1.24069 0.038607
C  4.244776 0.312311 -0.576962
C  4.028267 1.973157 1.337385
C  5.004091 1.124592 0.495657
C  0.258812 0.727216 -1.067106
C  2.438957 3.859829 1.210038
C  -0.990167 -1.257867 -0.214643
C  -2.100964 0.987145 -0.284762
C  -2.189616 -1.999489 -0.003213
C  -3.422855 0.49194 -0.086898
C  0.239396 -1.959769 -0.057068
C  -1.917629 2.396926 -0.184952
C  -2.154044 -3.347997 0.402383
C  -4.490288 1.351374 0.236948
C  0.270282 -3.323884 0.305391
C  -2.996695 3.262477 0.096534
C  -0.924609 -4.02754 0.558589
C  -4.289487 2.747906 0.322258
C  2.025629 -5.045548 -1.14792
H  1.933516 2.869955 -1.203093
H  4.023417 1.966279 -1.966858
H  2.802312 0.690224 -2.191817
H  0.646248 1.859497 0.752391
H  1.615476 0.392051 0.623844
H  4.95894 -0.226012 -1.228447
H  3.623537 -0.464763 -0.086712
H  3.416677 1.29859 1.99105
H  4.599231 2.635946 2.015645
H  5.578637 0.453051 1.162145
H  5.723214 1.803493 -0.002133
H  0.764935 -0.023596 -1.698495
H  -0.009052 1.563966 -1.739765
H  1.880528 4.496203 0.498289
H  3.147851 4.508257 1.757401
H  1.709389 3.459069 1.957397
H  1.194192 -1.455396 -0.209325
H  -0.926958 2.834047 -0.324286
H  -3.097528 -3.874459 0.582282
H  -5.486342 0.925099 0.398931
H  -2.813854 4.341138 0.150735
H  -0.899623 -5.073915 0.876023
H  -5.127808 3.411712 0.555016
H  2.024775 -4.315331 -1.971287
H  1.182529 -5.744816 -1.253742
H  2.976504 -5.601647 -1.135244
