program: Gaussian 09
title: 000040776
version: EM64L-G09RevD.01
frameworkgroup: C1[X(C10H10ClNO4)]
method: RPBEPBE
basis: SDD
operation: Freq
keyword: #p
keyword: freq=noraman
keyword: PBEPBE/SDD
title: #p freq=noraman PBEPBE/SDD
converged: YES YES NO NO
title: Mulliken charges:
elementType: Cl O O O O N C C C C C C C C C C H H H H H H H H H H
charge: -0.033711 -0.249997 -0.286063 -0.195206 -0.199309 0.024767 0.037336 -0.071855 -0.321436 0.310864 -0.657251 0.221368 -0.351771 -0.345952 -0.222030 -0.210296 0.256039 0.256557 0.221900 0.221360 0.277616 0.259658 0.290740 0.282610 0.240292 0.243770
chargesum: 0.00000
title: Mulliken charges with hydrogens summed into heavy atoms:
elementType: Cl O O O O N C C C C C C C C C C
charge: -0.033711 -0.249997 -0.286063 -0.195206 -0.199309 0.024767 0.293375 0.184702 0.121824 0.310864 -0.119977 0.221368 -0.061031 -0.063342 0.018262 0.033474
polarizability: 1.57554515e+02 2.99071095e+00 1.54694043e+02 2.66248902e+01 4.24094541e+00 9.55574361e+01
1716.lowfreq: 0.0019 0.0021 0.0024 2.0658 6.3120 9.7375 15.9350 32.1608 55.2968
frequency: 15.4823 32.1285 55.2900 60.6444 92.3244 124.1320 138.2169 175.4338 211.2210 235.0167 297.3433 303.1358 346.3751 383.2985 414.3831 420.3000 511.6496 542.5043 617.8351 642.0105 651.3466 674.2881 678.1102 692.0053 732.1690 784.2473 789.8032 815.6221 845.4849 871.9277 894.0960 908.7683 938.0852 981.1361 992.4486 1004.5956 1008.5561 1020.4762 1038.8650 1068.5050 1109.9867 1136.8819 1155.3592 1175.1872 1203.3758 1211.7900 1218.4557 1254.1748 1263.7924 1277.5095 1302.2860 1318.4541 1340.0863 1367.9225 1383.8977 1393.9869 1429.6505 1434.8378 1476.7371 1481.3947 1584.1836 1614.6218 2998.2403 3005.9449 3018.5471 3053.6508 3070.0411 3139.5724 3145.0894 3163.4058 3181.8804 3187.4678
redmass: 6.2766 11.8933 6.6413 6.0517 4.6504 5.0479 5.4868 3.3912 6.6949 6.7724 6.1887 6.8849 6.5440 7.6518 3.0013 3.5726 3.9595 6.2240 5.3147 4.8355 7.6657 5.6893 7.9266 5.7657 3.3623 6.4005 1.6519 3.0790 3.8132 3.1650 2.1002 1.6714 6.4070 1.4559 3.5680 4.9514 1.3587 2.1392 2.8019 2.9132 1.9498 1.8415 1.1010 1.0737 1.4141 1.8684 6.5561 1.1563 1.1648 1.5037 1.2228 1.2328 1.6028 2.1768 3.3924 4.9081 1.1118 2.3403 2.6616 1.0989 6.5611 7.1966 1.0786 1.0641 1.0843 1.0583 1.1085 1.1099 1.0872 1.0927 1.0937 1.0982
irintensity: 0.4470 0.4625 4.9880 5.2920 1.2832 2.2421 3.4707 0.4589 4.1335 0.4620 0.8512 0.9746 4.5379 3.2456 5.1848 5.1297 1.4180 0.4874 3.3288 10.9923 4.3768 18.0392 11.7533 43.5707 18.5658 19.3778 52.5674 22.7940 6.0736 64.2024 32.2839 11.7066 9.1642 11.8009 31.5829 176.9911 0.2264 2.2055 9.4816 8.1037 6.2812 2.0070 1.1844 6.8004 8.5920 52.8407 151.6562 5.5223 8.9997 26.2637 10.4860 7.1621 9.2227 31.0479 113.2985 33.7594 10.8214 22.7670 10.4917 3.7052 10.0222 2.4054 12.3741 70.7912 18.9447 14.6070 34.0605 8.8072 4.5259 11.2983 0.5149 10.4133
temp: 298.150 k
press: 1.00000 atm
elementType: 17 8 8 8 8 7 6 6 6 6 6 6 6 6 6 6 1 1 1 1 1 1 1 1 1 1
symmnumber: 1
zpe: 497094.3 jmol-1
zpe.correction: 0.189333 hartree
zpe.thermalcorrener: 0.203768 hartree
zpe.thermalcorrenthalpy: 0.204712 hartree
zpe.thermalcorrgfe: 0.144753 hartree
zpe.sumelectzpe: -1201.472395 hartree
zpe.sumelectthermal: -1201.457960 hartree
zpe.sumelectthermalent: -1201.457016 hartree
zpe.sumelectthermalfe: -1201.516975 hartree
dipole: -0.6128 -5.9530 -0.5111
dipole: 6.0062
quadrupole: -82.1795 -107.0625 -99.6894
quadrupole: -5.2231 9.9764 1.5446
quadrupole: 14.1310 -10.7520 -3.3790 -5.2231 9.9764 1.5446
hfenergy: -1201.661728 hartree
pointgroup: C01 [X(C10H10Cl1N1O4)]
dipole: -0.1658817 -2.3526706 -0.1460576 debye
dipolederiv: -0.2344928 -0.1042477 0.0681143 -0.1851715 -0.4364018 0.1659064 0.0980763 0.0958903 -0.2333357 -1.060694 -0.0778549 0.1359165 0.1243291 -0.4711541 0.0675432 0.1799974 0.0817197 -0.4212964 -0.9646373 0.2505081 0.0208895 0.1797749 -0.6151413 0.1210241 0.1360357 0.0774559 -0.4136148 -0.3685357 0.1238975 -0.1426335 0.1668341 -0.8271646 0.0777097 -0.1642083 0.0425509 -0.3617687 -0.5527773 -0.0044663 -0.2918909 0.000076 -0.5277222 -0.0859403 -0.3335701 -0.008473 -0.526463 0.6875292 0.0635166 0.5326561 0.0166146 1.4613292 0.1215389 0.5383401 0.0809144 0.7287871 0.6520139 0.0598473 -0.0033766 -0.2339614 0.0753127 0.1366479 0.1329381 0.0785487 0.2175261 1.0902483 -0.1309576 -0.0533549 -0.2285848 0.7307784 -0.1010989 -0.2345469 -0.110383 0.5989807 0.6194328 -0.2250179 0.054211 -0.0009166 0.174276 -0.0059172 -0.0580753 0.0440727 0.3247497 0.0073505 -0.0583291 -0.0255821 0.1797198 0.1146233 0.0894363 -0.0301166 -0.0513777 -0.078 0.2064595 0.1566406 -0.0589591 0.2590339 0.6139744 -0.2150493 -0.0994687 -0.1894907 0.2150531 0.0603928 -0.1621515 -0.0859207 -0.2257414 -0.3491757 -0.1342406 -0.0824224 -0.1272533 -0.045003 -0.2299147 -0.1610368 -0.047933 -0.1392706 -0.0388342 -0.0334178 -0.0362946 -0.0529585 -0.1288529 -0.1123376 0.1295287 0.0349999 -0.0701327 0.0235759 -0.0158682 0.0117316 0.1310881 -0.0544967 0.0695472 0.0842448 0.0865722 0.0357415 0.1440084 0.0580526 0.070061 0.0855097 -0.0767695 0.1048604 -0.0025637 0.1104522 0.0730386 -0.1946296 0.004163 0.1214992 -0.0068963 -0.0911087 -0.0706722 -0.0229204 -0.0148528 -0.0096748 0.0089522 -0.0776532 -0.104762 -0.0500332 -0.0679507 -0.0432318 -0.0131835 -0.0509713 -0.0518865 0.0228092 -0.046722 0.0639334 -0.0177848 -0.0802992 -0.027331 0.0440958 0.0320068 0.085987 0.0062334 -0.0772164 0.0935873 -0.1267319 -0.0289503 -0.0882958 0.0577245 -0.0798852 0.0044131 0.0570108 0.0206191 -0.1253512 0.0745013 -0.0896645 0.0713443 -0.0729934 -0.0722899 -0.0740047 -0.0463773 -0.0262699 -0.0210564 -0.0089223 -0.0022221 -0.0714147 0.0421815 0.0005177 0.03361 -0.0551003 0.0500861 -0.0025559 0.0699478 0.0751438 0.1549543 0.0537156 -0.0136343 0.0617345 0.0289039 -0.0160967 0.0183532 -0.0081635 0.1426835 0.1033961 0.0313295 -0.0073841 0.0646898 0.0523416 -0.0010508 -0.0323515 -0.0212503 0.152336 0.061673 -0.0550409 -0.0411431 -0.072023 -0.0428586 -0.063356 -0.0535164 -0.0598562 0.1245774 -0.0648672 -0.0064668 -0.0865245 0.0057711 0.0904302 -0.0128301 -0.0862572 -0.0226248 0.1199584 unknown
polarizability: 162.3515849|3.9734485|155.0875815|18.9457568|3.9183273|90.3668273 unknown
InChI: InChI=1S/C10H10ClNO4/c11-5-7-6-15-10(16-7)8-3-1-2-4-9(8)12(13)14/h1-4,7,10H,5-6H2
charge 0 multiplicity 1
26 atoms
Cl 4.024375 1.531437 -1.587272
O  1.372167 0.103872 -0.263757
O  1.062571 -1.986049 0.728591
O  -1.753989 2.954392 0.145057
O  -0.326654 1.906243 1.572384
N  -1.219331 1.890817 0.640154
C  2.739392 -0.362943 0.058346
C  0.525803 -0.608867 0.705532
C  2.520947 -1.850192 0.516847
C  -0.908268 -0.602865 0.213528
C  3.612192 -0.256624 -1.179819
C  -1.700373 0.574567 0.133146
C  -1.481601 -1.805779 -0.25859
C  -3.003881 0.563021 -0.411277
C  -2.7919 -1.837413 -0.784221
C  -3.554392 -0.650228 -0.866835
H  3.150278 0.245285 0.888503
H  0.638114 -0.155613 1.708223
H  2.805929 -2.584959 -0.257159
H  3.063149 -2.064208 1.455563
H  3.095701 -0.664974 -2.061213
H  4.584246 -0.75042 -1.025546
H  -0.873246 -2.712118 -0.209216
H  -3.559411 1.502764 -0.466232
H  -3.212108 -2.785876 -1.134746
H  -4.56791 -0.667168 -1.279691
