program: Gaussian 09
title: 000005329
version: EM64L-G09RevD.01
frameworkgroup: C1[X(C10H11N3O3S)]
method: RPBEPBE
basis: SDD
operation: Freq
keyword: #p
keyword: freq=noraman
keyword: PBEPBE/SDD
title: #p freq=noraman PBEPBE/SDD
converged: YES YES NO NO
title: Mulliken charges:
elementType: S O O O N N N C C C C C C C C C C H H H H H H H H H H H
charge: 0.935662 -0.214851 -0.545178 -0.496771 -0.564402 -0.070953 -0.687339 -0.087583 -0.229765 -0.146845 0.244048 0.518677 -0.390069 -0.408768 -0.497668 0.388280 -0.755590 0.322488 0.284053 0.292200 0.230597 0.232868 0.267966 0.241097 0.251789 0.255619 0.314383 0.316054
chargesum: 0.00000
title: Mulliken charges with hydrogens summed into heavy atoms:
elementType: S O O O N N N C C C C C C C C C C
charge: 0.935662 -0.214851 -0.545178 -0.496771 -0.241913 -0.070953 -0.056902 -0.087583 0.054288 0.145355 0.244048 0.518677 -0.159472 -0.175900 -0.229702 0.388280 -0.007085
polarizability: 2.57001450e+02 -8.24185522e+00 1.72681280e+02 -1.30421083e+01 -1.63020250e+01 1.05559064e+02
1716.lowfreq: -8.5747 -0.0022 -0.0014 -0.0007 0.4858 5.2263 15.1312 27.3490 46.1075
frequency: 14.6293 27.2936 46.0696 69.9049 85.0381 95.6102 133.3570 148.5164 178.1284 196.9061 229.5760 238.5864 277.9480 318.1160 323.2877 369.7378 400.0461 403.3680 410.3810 412.5282 426.4464 437.3428 440.6514 518.8232 578.1957 599.3668 612.8006 622.6287 673.0554 717.7130 726.4661 743.1240 801.3280 810.0232 813.6948 816.4867 833.3766 858.9278 924.4899 944.9486 948.4213 965.6282 980.5512 996.7196 1002.3514 1022.8741 1048.8013 1051.7235 1134.7372 1141.5639 1187.3032 1189.7761 1254.8065 1305.3671 1325.1675 1400.0105 1402.9604 1408.2179 1437.4306 1439.5625 1456.0007 1469.5119 1490.5034 1584.4273 1606.8714 1613.6250 1648.6204 2995.0285 3076.6836 3113.8605 3135.7544 3138.6824 3165.0512 3175.2286 3240.9970 3440.7217 3562.2675 3701.4437
redmass: 4.5994 4.9835 4.8404 4.6410 2.1184 1.7781 7.2022 5.2145 4.4875 10.4498 7.9124 5.7845 5.3280 3.8391 5.4286 7.8840 7.6613 3.3146 1.5461 1.4858 1.9318 2.1039 2.8224 2.6878 5.8073 5.9025 5.2168 6.7743 3.5027 2.8892 3.2058 3.1126 6.0204 1.3146 2.4363 2.3548 1.8151 6.5269 4.3074 1.6279 5.4999 1.3621 5.0496 3.0891 2.3191 1.4470 1.4951 2.5401 1.2021 1.9438 1.4416 1.3377 1.9930 1.3225 2.4649 5.3956 1.3112 3.3104 3.7576 5.2678 1.0425 1.1365 2.8483 7.3088 6.5627 4.8045 1.2250 1.0372 1.0982 1.0987 1.0893 1.0899 1.0958 1.0958 1.0999 1.0766 1.0452 1.1040
irintensity: 1.8760 5.9225 4.2262 1.8410 0.1371 1.2147 0.9469 1.9135 0.3454 0.5158 11.5531 6.0278 12.0495 7.8094 10.2158 10.7671 50.7996 2.0666 1.8100 1.3070 75.6880 141.3498 285.4629 32.9360 1.0905 6.7124 19.7312 2.3500 52.7489 14.4469 74.2400 80.7323 35.8599 2.7236 11.9071 109.8574 88.1924 9.7714 8.0869 11.6355 52.3433 0.4602 7.9957 4.1108 14.7319 1.8683 8.8617 61.6751 13.8412 6.1348 37.6640 19.6741 31.8267 10.9220 63.9191 2.1826 2.1513 74.9173 3.2165 79.0241 16.4318 42.4416 72.4898 8.5132 103.1291 171.9993 271.5288 17.9541 9.0212 10.0820 13.8218 12.6301 7.0709 9.0403 0.7504 28.2203 119.1778 25.5390
temp: 298.150 k
press: 1.00000 atm
elementType: 16 8 8 8 7 7 7 6 6 6 6 6 6 6 6 6 6 1 1 1 1 1 1 1 1 1 1 1
symmnumber: 1
zpe: 529575.9 jmol-1
zpe.correction: 0.201705 hartree
zpe.thermalcorrener: 0.218869 hartree
zpe.thermalcorrenthalpy: 0.219813 hartree
zpe.thermalcorrgfe: 0.154621 hartree
zpe.sumelectzpe: -1174.191339 hartree
zpe.sumelectthermal: -1174.174175 hartree
zpe.sumelectthermalent: -1174.173231 hartree
zpe.sumelectthermalfe: -1174.238423 hartree
dipole: 1.4903 -3.9826 -3.0736
dipole: 5.2468
quadrupole: -51.3846 -109.0491 -112.4787
quadrupole: -15.0796 0.2961 -7.9241
quadrupole: 39.5862 -18.0783 -21.5079 -15.0796 0.2961 -7.9241
hfenergy: -1174.3930438 hartree
pointgroup: C01 [X(C10H11N3O3S1)]
dipole: 0.7060829 1.8152643 0.6836238 debye
polarizability: 258.3132531|5.4748092|158.2962982|-0.9732144|-32.4032578|118.6322435 unknown
InChI: InChI=1S/C10H11N3O3S/c1-7-6-10(12-16-7)13-17(14,15)9-4-2-8(11)3-5-9/h2-6,13H,11H2,1H3
charge 0 multiplicity 1
28 atoms
S  0.168564 -1.521365 0.227468
O  -2.948841 1.843689 -0.331847
O  0.609134 -2.790035 1.149362
O  -0.583735 -1.717899 -1.198232
N  -1.008795 -0.569803 1.447749
N  -1.670829 1.208511 -0.004819
N  4.956952 2.087969 -0.485855
C  1.619942 -0.386295 0.020892
C  2.768993 -0.646407 0.789936
C  1.533195 0.672886 -0.902348
C  -2.0080 0.236279 0.894306
C  3.849557 1.267729 -0.314862
C  3.888808 0.182846 0.614942
C  2.656556 1.49787 -1.068736
C  -3.426417 0.221953 1.182182
C  -3.970473 1.235465 0.416931
C  -5.350293 1.772919 0.217519
H  -1.332925 -1.298548 2.103675
H  2.783956 -1.487803 1.489841
H  0.608738 0.852909 -1.458791
H  4.798981 -0.004481 1.195943
H  2.613094 2.331915 -1.778118
H  -3.951224 -0.450695 1.855836
H  -6.070131 1.21385 0.836042
H  -5.40459 2.840834 0.495605
H  -5.657288 1.687584 -0.840205
H  5.808707 1.934423 0.046444
H  4.935464 2.8633 -1.142259
