program: Gaussian 09
title: 000040758
version: EM64L-G09RevD.01
frameworkgroup: C1[X(C9H21NO3)]
method: RPBEPBE
basis: SDD
operation: Freq
keyword: #p
keyword: freq=noraman
keyword: PBEPBE/SDD
title: #p freq=noraman PBEPBE/SDD
converged: YES YES NO NO
title: Mulliken charges:
elementType: O O O N C C C C C C C C C H H H H H H H H H H H H H H H H H H H H H
charge: -0.436316 -0.434722 -0.432222 -0.166503 0.000486 -0.042645 -0.121928 -0.405173 -0.349037 -0.354053 -0.734116 -0.727023 -0.685211 0.222927 0.183354 0.214166 0.234741 0.189783 0.215432 0.204244 0.202095 0.207312 0.233132 0.217357 0.203226 0.246517 0.219144 0.224147 0.241901 0.210807 0.217569 0.337985 0.330709 0.331914
chargesum: 0.00000
title: Mulliken charges with hydrogens summed into heavy atoms:
elementType: O O O N C C C C C C C C C
charge: -0.098331 -0.104013 -0.100308 -0.166503 0.223413 0.140709 0.092238 0.019351 0.070639 0.055354 -0.080401 -0.037214 -0.014934
polarizability: 1.25140687e+02 1.44966266e+00 1.24374169e+02 2.81834170e+00 2.03974715e+00 1.00730858e+02
1716.lowfreq: -11.9151 -6.4724 -0.0005 0.0003 0.0004 11.2995 36.3036 66.8559 73.3626
frequency: 35.6820 66.8394 73.3510 92.3038 95.0335 118.5023 148.9612 167.4259 191.5048 218.9442 232.1834 238.0079 256.3602 258.4958 291.3302 305.1641 306.1825 309.2913 314.6740 331.2247 363.3790 418.3634 443.0844 461.8762 495.8185 552.7143 596.8672 731.8147 838.7394 847.6554 879.7691 892.6201 895.7642 905.0309 950.7808 964.1420 976.6192 980.6846 994.3788 1033.0650 1067.8017 1070.2331 1086.7984 1098.6751 1109.2950 1138.3925 1147.6675 1160.4369 1199.9980 1207.7702 1225.6014 1290.2572 1297.7714 1301.5479 1316.7812 1326.2806 1333.4461 1343.6032 1358.6768 1361.9722 1367.3836 1373.8109 1378.0151 1383.3220 1384.7324 1393.6390 1459.5263 1463.1754 1465.7911 1472.1189 1472.6925 1478.6471 1480.2231 1485.4249 1498.6844 2909.6984 2946.9141 2965.4442 2971.3403 2976.0642 2978.0576 2981.6742 2988.7765 3009.0468 3065.8797 3067.6141 3072.5973 3080.3567 3082.0037 3084.9459 3087.0471 3093.4439 3107.7883 3554.4468 3556.9376 3570.1514
redmass: 3.5435 3.3627 3.8917 2.6545 2.8900 3.1867 1.9663 3.1554 3.0134 1.0778 1.6788 1.3356 1.7320 2.0432 2.0547 1.8559 1.5069 3.4602 1.4716 2.3600 1.5498 2.4294 2.3127 2.6368 3.2811 3.3534 2.8999 2.7659 2.6183 2.4637 2.4860 1.3240 1.3262 1.2375 1.8306 3.0729 3.4955 3.5044 3.1104 1.7827 1.3910 1.4571 1.4552 3.1902 2.5903 2.3443 1.9914 2.2068 1.5912 1.7674 1.9635 1.2009 1.2249 1.2315 1.2981 1.2601 1.3700 1.3047 1.2511 1.2105 1.2182 1.2397 1.2288 1.2004 1.1927 1.2053 1.0634 1.0668 1.0646 1.0746 1.0621 1.0634 1.0538 1.0562 1.0456 1.0809 1.0681 1.0816 1.0617 1.0384 1.0400 1.0639 1.0365 1.0822 1.1000 1.0990 1.0996 1.0956 1.0997 1.0994 1.0992 1.0984 1.0945 1.0662 1.0662 1.0660
irintensity: 0.9432 1.7934 1.2642 4.0808 5.2471 1.7087 7.5377 0.4249 0.3558 0.2085 5.5236 16.1319 4.3595 14.0680 27.1689 83.2609 131.7337 4.2815 12.5915 113.6149 65.3894 14.3501 37.2878 9.2314 10.6855 3.7924 3.7707 0.7506 5.8348 5.6885 12.4353 25.1855 15.5457 13.0518 5.9708 106.2400 48.5853 102.6116 80.5350 0.8374 16.0748 9.1525 34.0278 17.9004 60.3790 23.2886 32.0175 30.0409 16.7493 23.0496 8.0708 7.3764 8.1200 5.5682 5.6161 11.2526 13.5513 2.3509 4.5221 21.1012 6.7037 3.4547 47.8338 19.8213 6.9358 5.9121 7.3715 1.9484 3.5717 1.7408 3.9132 9.6013 13.0644 3.8308 14.5897 25.2131 70.5103 30.0788 51.8548 15.8804 23.9627 76.1139 13.7862 21.1914 5.5746 47.7258 64.6467 24.8848 31.6922 22.3495 25.6847 40.2898 24.9111 6.2686 6.9874 5.7431
temp: 298.150 k
press: 1.00000 atm
elementType: 8 8 8 7 6 6 6 6 6 6 6 6 6 1 1 1 1 1 1 1 1 1 1 1 1 1 1 1 1 1 1 1 1 1
symmnumber: 1
zpe: 780115.0 jmol-1
zpe.correction: 0.297130 hartree
zpe.thermalcorrener: 0.314254 hartree
zpe.thermalcorrenthalpy: 0.315198 hartree
zpe.thermalcorrgfe: 0.253257 hartree
zpe.sumelectzpe: -634.803853 hartree
zpe.sumelectthermal: -634.786730 hartree
zpe.sumelectthermalent: -634.785786 hartree
zpe.sumelectthermalfe: -634.847726 hartree
dipole: -0.6871 0.3444 -1.1567
dipole: 1.3888
quadrupole: -92.3313 -90.9065 -80.3764
quadrupole: 2.8228 8.1538 -1.8408
quadrupole: -4.4599 -3.0351 7.4950 2.8228 8.1538 -1.8408
hfenergy: -635.1009833 hartree
pointgroup: C01 [X(C9H21N1O3)]
dipole: 0.0070175 -0.3050667 -0.4532321 debye
polarizability: 125.1699527|-1.8129525|124.5834787|1.8067656|1.3928466|100.4922836 unknown
InChI: InChI=1S/C9H21NO3/c1-7(4-11)10(8(2)5-12)9(3)6-13/h7-9,11-13H,4-6H2,1-3H3
charge 0 multiplicity 1
34 atoms
O  1.244911 -3.687116 0.272861
O  1.299297 3.544326 -0.288031
O  -3.53207 0.280324 -1.310587
N  0.054215 -0.06335 -0.08698
C  0.956212 -1.196982 0.293377
C  0.428649 1.296592 0.43101
C  -1.418847 -0.318329 -0.097667
C  0.35429 -2.579046 -0.092857
C  1.166298 2.124834 -0.662455
C  -2.125201 0.650717 -1.087147
C  2.337634 -1.048476 -0.389597
C  1.183215 1.341325 1.781804
C  -2.107251 -0.311301 1.291849
H  1.12019 -1.235595 1.395267
H  -0.526968 1.832971 0.609319
H  -1.566504 -1.32161 -0.54067
H  -0.561815 -2.792846 0.480672
H  0.119613 -2.59753 -1.180197
H  2.205928 1.786998 -0.797644
H  0.628914 2.006757 -1.625639
H  -2.190049 1.676041 -0.68411
H  -1.550132 0.669996 -2.036254
H  2.810523 -0.083247 -0.152228
H  2.231206 -1.112321 -1.488958
H  3.037232 -1.830136 -0.036482
H  1.390209 2.397375 2.030976
H  2.153589 0.815957 1.748672
H  0.580331 0.898246 2.59468
H  -3.194786 -0.468825 1.175666
H  -1.96369 0.655808 1.809366
H  -1.701691 -1.107794 1.94224
H  2.048175 -3.666284 -0.305244
H  0.398694 3.957169 -0.268137
H  -3.563918 -0.591148 -1.780972
