program: Gaussian 09
title: 000005337
version: EM64L-G09RevD.01
frameworkgroup: C1[X(C14H11N4O2S)]
method: RPBEPBE
basis: SDD
operation: Freq
keyword: #p
keyword: freq=noraman
keyword: PBEPBE/SDD
title: #p freq=noraman PBEPBE/SDD
converged: YES YES NO NO
title: Mulliken charges:
elementType: S O O N N N N C C C C C C C C C C C C C C H H H H H H H H H H H
charge: 0.934204 -0.572841 -0.604216 -0.407164 -0.075763 -0.035137 -0.706697 -0.171422 -0.223240 -0.139631 0.087080 0.072516 0.067550 0.506801 -0.413828 -0.431840 -0.348897 -0.334067 -0.398659 -0.230619 -0.263691 0.286294 0.299072 0.204525 0.207935 0.230906 0.231895 0.239059 0.202087 0.204865 0.292793 0.290130
chargesum: -1.00000
title: Mulliken charges with hydrogens summed into heavy atoms:
elementType: S O O N N N N C C C C C C C C C C C C C C
charge: 0.934204 -0.572841 -0.604216 -0.407164 -0.075763 -0.035137 -0.123773 -0.171422 0.063054 0.159441 0.087080 0.072516 0.067550 0.506801 -0.209304 -0.223906 -0.117991 -0.102172 -0.159600 -0.028532 -0.058826
polarizability: 3.24574080e+02 3.61297513e+01 2.45750335e+02 9.46102677e+00 2.61842409e+01 1.45876174e+02
1716.lowfreq: -10.9090 -0.0012 0.0006 0.0009 3.7176 6.9819 21.2257 30.7421 48.0738
frequency: 21.1667 30.7072 48.0418 66.0883 81.8362 115.9914 133.6804 162.4273 183.2499 219.8840 222.8024 231.7368 262.7059 287.8326 296.9388 325.9141 357.4015 370.7759 396.5412 405.3676 413.1648 418.3962 446.9879 484.7954 504.9549 520.3079 531.7192 552.2748 570.1407 590.7951 624.4390 626.6469 669.7542 720.1138 729.4052 751.6204 758.6267 777.8136 791.3134 803.9236 809.4220 824.9757 853.7785 887.8697 898.6293 906.4922 938.1641 944.0882 954.8763 961.8051 967.7200 987.8620 1011.2233 1013.8440 1053.2222 1097.5759 1116.5851 1143.1192 1173.6588 1175.6520 1219.6868 1250.5702 1288.7545 1295.4026 1300.6323 1348.3292 1368.5311 1392.2609 1398.6472 1418.5074 1448.0742 1458.8685 1481.8323 1507.6648 1544.5650 1590.4090 1607.4150 1608.7571 1633.3074 3104.7474 3107.4196 3111.9139 3122.9586 3132.8020 3140.1099 3146.4264 3152.2973 3153.4822 3570.4656 3713.7727
redmass: 5.2820 5.5803 4.2116 6.6763 6.2664 6.1585 7.2412 6.4246 4.8470 7.9839 9.6443 9.1071 1.2878 6.3430 7.4201 6.4989 1.0380 5.5268 3.3823 6.7802 3.0287 4.6788 9.6756 4.4875 6.5770 5.8054 3.3315 4.1111 8.2906 7.4074 9.2939 7.0298 3.3297 7.3299 2.9135 1.3639 6.4018 3.3061 8.3565 2.3932 1.9388 1.8526 1.6841 6.3192 1.4825 14.1310 1.3769 1.4289 6.1843 1.2903 1.3418 4.9503 2.0113 1.4419 2.4478 1.8275 1.1997 1.2585 1.3376 1.6297 2.7419 1.8969 1.7010 2.7232 1.8626 1.9127 7.8315 7.7588 3.9038 3.1809 3.3378 3.8376 2.7921 6.9568 7.0883 7.5980 6.6402 4.5619 1.2423 1.0842 1.0892 1.0894 1.0882 1.0913 1.0944 1.0940 1.0999 1.0948 1.0442 1.1040
irintensity: 1.4143 0.6565 0.7882 0.0339 0.9353 0.8934 0.8561 3.4201 1.9878 6.6181 1.3715 5.2530 308.7094 1.3206 1.3350 3.3560 0.3757 12.2678 2.1327 11.3722 4.5881 30.6575 113.1359 5.2976 27.7380 7.2234 94.5401 11.3278 25.8671 38.8162 24.3327 6.6161 4.2727 2.7893 2.9792 84.7307 6.1797 2.1576 163.9655 58.5118 24.5793 72.9751 2.1044 8.1177 12.0135 89.6282 8.5308 1.3759 16.0885 0.1792 0.8093 1.3593 19.1721 0.3697 24.9318 3.1242 10.5551 6.1511 52.6870 11.4325 26.7934 0.1924 35.2150 11.1379 46.0972 27.4560 277.4421 3.3923 247.3738 1.9825 76.1342 67.5530 99.8137 171.2633 4.7549 15.6021 41.5794 76.5691 233.0363 9.0142 38.8544 26.3155 16.0354 22.8366 51.0616 13.6895 57.9016 30.4073 48.2852 13.7225
temp: 298.150 k
press: 1.00000 atm
elementType: 16 8 8 7 7 7 7 6 6 6 6 6 6 6 6 6 6 6 6 6 6 1 1 1 1 1 1 1 1 1 1 1
symmnumber: 1
zpe: 591239.1 jmol-1
zpe.correction: 0.225191 hartree
zpe.thermalcorrener: 0.243676 hartree
zpe.thermalcorrenthalpy: 0.244620 hartree
zpe.thermalcorrgfe: 0.177365 hartree
zpe.sumelectzpe: -1306.042462 hartree
zpe.sumelectthermal: -1306.023977 hartree
zpe.sumelectthermalent: -1306.023033 hartree
zpe.sumelectthermalfe: -1306.090288 hartree
dipole: -1.8244 11.0236 -2.4529
dipole: 11.4396
quadrupole: -153.1709 -147.1748 -145.8542
quadrupole: -20.8717 13.7537 4.8495
quadrupole: -4.4376 1.5585 2.8791 -20.8717 13.7537 4.8495
hfenergy: -1306.2676531 hartree
pointgroup: C01 [X(C14H11N4O2S1)]
dipole: 0.532142 4.4655392 0.1790539 debye
polarizability: 328.2127347|-31.1316407|230.9971383|12.243444|-40.0927896|156.9907153 unknown
InChI: InChI=1S/C14H11N4O2S/c15-10-5-7-11(8-6-10)21(19,20)18-14-9-16-12-3-1-2-4-13(12)17-14/h1-9H,15H2
charge -1 multiplicity 1
32 atoms
S  1.645863 -2.037895 -0.259878
O  1.220149 -2.297259 -1.821662
O  2.842553 -2.976842 0.348965
N  0.288803 -2.206462 0.984253
N  -1.063285 -0.541663 -0.22965
N  -3.080169 -1.118858 1.774292
N  4.13081 3.546151 0.024829
C  2.366267 -0.276169 -0.14964
C  3.575013 -0.116001 0.548566
C  1.72947 0.795822 -0.79846
C  -2.293357 0.090456 -0.236982
C  -3.316375 -0.177868 0.754821
C  -0.838333 -1.469669 0.767767
C  3.545207 2.272527 -0.033278
C  4.166575 1.161962 0.608256
C  2.322581 2.072788 -0.739012
C  -2.589118 1.055223 -1.256926
C  -4.563229 0.501758 0.708452
C  -1.898676 -1.729264 1.766519
C  -3.825244 1.715387 -1.28435
C  -4.8246 1.445252 -0.299415
H  4.03288 -0.995131 1.015957
H  0.773409 0.617105 -1.301085
H  5.110601 1.304656 1.150458
H  1.834739 2.923797 -1.231951
H  -1.820814 1.246086 -2.014783
H  -5.30236 0.261207 1.481658
H  -1.690797 -2.470403 2.546384
H  -4.030651 2.447533 -2.075959
H  -5.787277 1.968717 -0.334685
H  3.673476 4.344174 -0.404135
H  4.984787 3.699183 0.551373
