program: Gaussian 09
title: 000040779
version: EM64L-G09RevD.01
frameworkgroup: C1[X(C12H13Cl3O4)]
method: RPBEPBE
basis: SDD
operation: Freq
keyword: #p
keyword: freq=noraman
keyword: PBEPBE/SDD
title: #p freq=noraman PBEPBE/SDD
converged: YES YES NO NO
title: Mulliken charges:
elementType: Cl Cl Cl O O O O C C C C C C C C C C C C H H H H H H H H H H H H H
charge: 0.000665 -0.011035 0.000287 -0.315772 -0.243493 -0.428771 -0.194052 -0.004064 -0.121817 0.257033 -0.336294 -0.690875 -0.710782 0.556410 -0.365825 -0.259707 -0.112974 -0.184146 -0.126247 0.259256 0.247859 0.199551 0.220197 0.261561 0.224946 0.224164 0.248331 0.217065 0.259855 0.299334 0.284645 0.344693
chargesum: 0.00000
title: Mulliken charges with hydrogens summed into heavy atoms:
elementType: Cl Cl Cl O O O O C C C C C C C C C C C C
charge: 0.000665 -0.011035 0.000287 -0.315772 -0.243493 -0.084078 -0.194052 0.255192 0.126042 0.257033 0.083453 0.019797 0.014469 0.556410 -0.365825 0.039627 -0.112974 0.100499 -0.126247
polarizability: 1.98950996e+02 -5.01487361e+00 2.16002910e+02 1.34982905e+01 2.13673860e+00 1.05164395e+02
1716.lowfreq: -11.6195 -3.4871 -1.3272 -0.0028 -0.0020 -0.0008 14.5337 26.5553 33.7736
frequency: 13.6193 26.4398 33.7543 52.4020 69.1204 72.9960 93.8156 117.7330 141.7567 143.4931 169.1525 180.9035 191.2420 212.2238 221.9543 230.9659 233.7346 246.4207 280.4302 294.4440 319.5172 346.1062 360.9805 387.8959 398.5740 437.7303 448.0309 453.8420 498.3792 521.7207 553.1104 606.0055 655.2763 671.0971 694.3591 707.2527 715.6331 763.9549 823.3139 849.8992 854.4943 867.8876 890.7601 919.3611 931.0849 998.6159 1022.2635 1035.1977 1038.8848 1074.7078 1092.5038 1112.7972 1125.4878 1136.9743 1143.3621 1196.7919 1230.6634 1252.3578 1293.9933 1310.9361 1315.6674 1322.7279 1331.8814 1340.4127 1373.0721 1381.8578 1392.5165 1395.1443 1455.4280 1456.5836 1459.8536 1469.9134 1473.0868 1480.7766 1557.1665 1589.0873 1658.8323 2968.8790 2993.9888 3004.6052 3016.7379 3047.0977 3083.3842 3092.1734 3105.3378 3108.2505 3121.9815 3176.0012 3180.9844 3557.6769
redmass: 6.2607 7.9590 6.2023 6.0598 10.1713 7.3210 5.9331 5.8559 2.7884 5.8284 8.0956 19.6596 3.8472 2.6912 1.2606 1.4802 2.7301 3.0705 5.3528 7.1042 15.0006 4.4436 5.1729 2.5044 1.8173 4.2644 3.1889 5.1831 3.9667 6.5185 5.0448 10.3337 7.9549 3.7124 3.5315 5.8496 7.9221 4.1896 4.4304 1.5235 4.5545 1.3824 2.0635 1.3831 4.0512 3.6209 2.2871 2.6839 4.1185 2.1224 2.9522 2.1394 1.9582 1.9172 1.8567 1.4246 4.6318 1.2585 1.4378 1.3777 1.3398 1.3494 5.2215 1.3026 9.6154 1.3162 1.2132 1.2125 1.5198 1.4859 1.0980 1.0726 1.0545 1.0473 8.5683 8.4772 10.0752 1.0683 1.0369 1.0357 1.0853 1.0863 1.0968 1.0978 1.0994 1.1005 1.1017 1.0918 1.0931 1.0656
irintensity: 0.4040 0.3360 0.2476 2.6516 1.7807 1.8027 0.6823 1.4665 1.6374 1.7457 1.4385 0.3481 0.5910 2.6829 0.2218 0.2283 1.3784 8.5553 1.6333 5.1161 2.0729 20.5183 25.9182 37.2275 103.7210 3.7770 14.8164 4.3384 6.8712 18.8373 2.0183 0.2065 42.9774 6.7992 0.2713 27.6167 12.0056 17.9436 10.2627 2.0254 25.4005 50.1477 11.3503 19.3853 25.7475 102.8714 39.6868 220.7304 57.8308 163.8506 131.5589 12.2917 51.3588 14.9196 4.9893 19.2678 117.2576 7.7577 4.6362 8.5366 33.5161 5.2053 75.7530 12.4435 6.5850 6.5431 29.8626 29.2958 100.1425 124.3065 32.6705 18.4339 10.8928 22.6380 5.2897 25.5958 127.2885 41.8951 12.2843 10.0328 15.6145 7.8547 1.8140 47.7792 15.8979 11.9174 9.4859 4.8816 0.4802 4.8577
temp: 298.150 k
press: 1.00000 atm
elementType: 17 17 17 8 8 8 8 6 6 6 6 6 6 6 6 6 6 6 6 1 1 1 1 1 1 1 1 1 1 1 1 1
symmnumber: 1
zpe: 602197.2 jmol-1
zpe.correction: 0.229365 hartree
zpe.thermalcorrener: 0.250147 hartree
zpe.thermalcorrenthalpy: 0.251091 hartree
zpe.thermalcorrgfe: 0.176851 hartree
zpe.sumelectzpe: -2144.693093 hartree
zpe.sumelectthermal: -2144.672311 hartree
zpe.sumelectthermalent: -2144.671367 hartree
zpe.sumelectthermalfe: -2144.745607 hartree
dipole: -1.3826 -0.4296 -1.4124
dipole: 2.0226
quadrupole: -142.7674 -133.7095 -132.5346
quadrupole: 2.4448 1.3122 -9.2367
quadrupole: -6.4302 2.6277 3.8026 2.4448 1.3122 -9.2367
hfenergy: -2144.922458 hartree
pointgroup: C01 [X(C12H13Cl3O4)]
dipole: 0.5129848 -0.1016346 0.5997958 debye
polarizability: 196.0473772|5.1544512|216.0787763|19.7211496|-7.2195238|107.9921481 unknown
InChI: InChI=1S/C12H13Cl3O4/c1-6(5-16)18-12(17)7(2)19-11-4-9(14)8(13)3-10(11)15/h3-4,6-7,16H,5H2,1-2H3
charge 0 multiplicity 1
32 atoms
Cl -3.068292 2.760489 -0.633819
Cl -1.275077 -3.218856 0.871371
Cl -4.33866 -2.609329 -0.204664
O  2.450188 -0.135092 0.454272
O  -0.398905 1.934943 0.348044
O  5.11846 -0.67551 1.308961
O  1.926356 1.197255 -1.398411
C  3.340951 -1.025759 -0.395492
C  0.982612 1.733103 0.837428
C  1.810645 0.929227 -0.187751
C  4.296888 -1.667514 0.616605
C  2.477733 -2.032998 -1.160862
C  1.560733 3.140927 1.006749
C  -1.246015 0.83088 0.25135
C  -2.567682 1.077295 -0.208394
C  -0.881497 -0.495787 0.585989
C  -1.815094 -1.54201 0.446966
C  -3.496233 0.033452 -0.340821
C  -3.120553 -1.287787 -0.013118
H  3.890957 -0.358011 -1.08316
H  0.96123 1.184006 1.797951
H  3.718022 -2.289274 1.332043
H  5.010386 -2.315015 0.080346
H  1.801132 -1.517494 -1.86156
H  3.127382 -2.706299 -1.749433
H  1.875571 -2.65019 -0.470266
H  0.940233 3.713976 1.714983
H  2.592427 3.091145 1.397349
H  1.570727 3.660794 0.034988
H  0.122903 -0.734032 0.943158
H  -4.507699 0.241353 -0.698632
H  4.508272 -0.056187 1.785127
