program: Gaussian 09
title: 000005420
version: EM64L-G09RevD.01
frameworkgroup: C1[X(C12H32N4O3P2)]
method: RPBEPBE
basis: SDD
operation: Freq
keyword: #p
keyword: freq=noraman
keyword: PBEPBE/SDD
title: #p freq=noraman PBEPBE/SDD
converged: YES YES NO NO
title: Mulliken charges:
elementType: P P O O O N N N N C C C C C C C C C C C C H H H H H H H H H H H H H H H H H H H H H H H H H H H H H H H H
charge: 1.372306 1.371366 -0.702815 -0.644572 -0.644102 -0.741452 -0.762297 -0.741105 -0.761569 -0.004160 -0.015158 -0.004018 -0.015794 -0.650676 -0.674268 -0.679607 -0.660431 -0.651348 -0.672241 -0.676780 -0.659937 0.250629 0.217074 0.250056 0.217300 0.332936 0.389470 0.333001 0.388426 0.197452 0.243645 0.209326 0.198209 0.235015 0.215646 0.216061 0.228541 0.209769 0.211008 0.253904 0.202542 0.197341 0.243792 0.209656 0.197902 0.235225 0.214995 0.215591 0.227931 0.209395 0.211447 0.252410 0.202965
chargesum: 0.00000
title: Mulliken charges with hydrogens summed into heavy atoms:
elementType: P P O O O N N N N C C C C C C C C C C C C
charge: 1.372306 1.371366 -0.702815 -0.644572 -0.644102 -0.408516 -0.372827 -0.408104 -0.373144 0.246469 0.201916 0.246037 0.201507 -0.000253 -0.025398 -0.025237 0.007023 -0.000559 -0.024119 -0.023863 0.006886
polarizability: 2.50219836e+02 5.25646034e-02 2.12590687e+02 1.07796566e+00 4.19615711e-02 2.04482487e+02
1716.lowfreq: -5.4623 -0.6524 0.0007 0.0016 0.0018 4.0267 17.2580 20.5771 27.1431
frequency: 17.0546 20.3479 26.9327 35.5239 38.9795 45.5074 50.0736 53.6258 56.4034 61.5911 95.2198 122.3261 123.2047 145.6833 147.1800 173.2783 176.6027 203.1419 203.9874 213.0636 213.4456 217.0161 236.6212 238.4285 238.9985 243.3971 261.5473 269.3207 295.2873 318.0227 329.6520 341.1676 368.4835 375.5454 377.1108 387.9025 397.2372 419.0442 421.6023 439.6058 444.2782 457.8504 461.2650 494.3093 506.1989 510.3785 523.7807 611.8138 651.6971 670.5677 679.4404 766.5632 773.8827 816.9682 828.9814 848.7659 855.0889 884.9443 896.7218 919.4543 921.0293 924.2919 924.9060 937.8336 938.5284 939.3803 939.7403 963.9934 969.7365 1010.6186 1012.0455 1037.0032 1044.5944 1140.6917 1141.6103 1142.3865 1142.4959 1146.5972 1147.7952 1151.6465 1158.3347 1169.3113 1171.0206 1176.0535 1176.5365 1297.1220 1299.3396 1314.6652 1315.6136 1323.1878 1324.0613 1325.6366 1326.6840 1376.2950 1377.2218 1378.1565 1378.6797 1392.3477 1393.3360 1395.5408 1396.9429 1404.0208 1405.6081 1457.3033 1458.6914 1461.4680 1461.9174 1462.4744 1462.6472 1464.4035 1464.8437 1466.2980 1468.7833 1477.1155 1477.3185 1481.8843 1482.7763 1484.6474 1487.2806 1488.4887 1488.9213 2973.8372 2974.4172 2974.4916 2974.5501 2977.8019 2978.0038 2981.2487 2981.3656 2991.8568 2993.1197 3018.1207 3018.8058 3067.1810 3067.3932 3071.4145 3071.8393 3078.1921 3078.3050 3080.2158 3080.7311 3083.8806 3084.0808 3088.9149 3089.8322 3093.6820 3093.9546 3096.0716 3096.8948 3302.1033 3312.2183 3533.4560 3533.9530
redmass: 3.6912 2.8792 2.7351 3.1819 3.3904 3.4693 4.0655 2.6430 2.6725 3.9252 4.7843 5.1776 4.6706 4.1134 4.9556 4.0759 5.0082 1.0355 1.0330 4.5620 1.0372 1.0288 1.2900 1.5795 1.1124 1.2123 1.9832 2.7971 2.4625 2.8889 3.6738 2.7693 4.0746 2.7373 3.0228 2.7495 2.6465 2.4665 2.0192 4.9772 2.6274 2.9657 3.3984 3.5548 3.2127 1.9563 1.8008 7.2598 2.5735 1.7902 3.5105 2.3860 2.3988 1.9400 1.8818 3.0217 2.9911 2.8450 2.4559 1.2567 1.2538 1.2503 1.2441 1.3738 1.3814 1.3878 1.3914 2.7747 3.1352 3.0268 2.6911 3.8075 5.4293 2.1464 2.1773 2.1893 2.1413 2.2511 2.2852 2.2355 2.2005 1.9715 1.9793 1.9950 2.0324 1.2600 1.2566 1.4223 1.4179 1.3757 1.3700 1.2209 1.2256 1.2205 1.2193 1.2165 1.2177 1.2383 1.2337 1.2163 1.2168 1.2284 1.2294 1.0943 1.0910 1.0460 1.0462 1.0466 1.0471 1.0516 1.0514 1.0516 1.0510 1.0554 1.0553 1.0534 1.0542 1.0813 1.0620 1.0995 1.0613 1.0352 1.0352 1.0361 1.0361 1.0375 1.0374 1.0366 1.0365 1.0844 1.0846 1.0850 1.0851 1.0987 1.0988 1.1000 1.1000 1.0979 1.0979 1.0992 1.0991 1.1008 1.1009 1.1005 1.1005 1.1002 1.1002 1.1002 1.1002 1.0783 1.0787 1.0758 1.0758
irintensity: 0.0780 0.2840 0.1182 0.3256 0.4917 0.0358 2.5819 0.1438 0.1967 2.0338 0.0488 1.7253 0.0401 2.4094 17.8236 18.6703 1.9994 0.2346 0.1638 4.2786 0.0942 0.2347 2.5926 8.9017 0.1375 1.1331 9.4609 6.8188 0.9839 0.1423 0.3593 1.7307 22.2248 1.0752 26.9405 28.4876 9.4664 1.4870 0.4825 1.0678 7.8773 17.6121 8.6115 14.0766 11.6487 50.4563 223.7146 79.5305 352.8046 3.6599 482.8345 50.7201 1.2649 20.6219 24.8429 2.9427 10.0923 64.6650 122.5717 6.7195 4.9390 3.6542 3.8383 0.6670 0.9507 1.5908 2.6474 48.8709 22.3098 75.8130 82.6682 182.2968 122.2549 45.2449 6.8363 47.6088 7.7393 88.9561 107.0010 98.7475 35.7557 77.4268 112.9045 22.3513 1.3893 17.2000 18.5905 4.7126 3.7671 2.8812 3.0022 2.6801 5.3199 23.9803 18.7636 34.7657 9.7306 33.6159 46.0287 16.9826 34.3655 20.3300 26.3080 63.9216 27.3062 1.8658 2.9466 8.0593 5.7676 9.9311 1.9199 3.1684 2.9414 20.2918 7.5266 19.4793 0.6817 18.8792 120.1887 1.9536 6.5606 9.6892 35.7201 24.2707 12.1055 33.6563 39.9083 44.3546 8.3773 17.3341 16.4680 0.0981 0.1137 2.6792 2.2068 5.1746 3.0281 74.6834 67.9365 146.6696 12.6340 16.0245 26.6708 29.3624 22.5335 23.8694 48.7805 36.5019 40.5120 41.2988 282.9768 32.2197 17.2775
temp: 298.150 k
press: 1.00000 atm
elementType: 15 15 8 8 8 7 7 7 7 6 6 6 6 6 6 6 6 6 6 6 6 1 1 1 1 1 1 1 1 1 1 1 1 1 1 1 1 1 1 1 1 1 1 1 1 1 1 1 1 1 1 1 1
symmnumber: 1
zpe: 1185463.1 jmol-1
zpe.correction: 0.451519 hartree
zpe.thermalcorrener: 0.481117 hartree
zpe.thermalcorrenthalpy: 0.482061 hartree
zpe.thermalcorrgfe: 0.388644 hartree
zpe.sumelectzpe: -1601.873098 hartree
zpe.sumelectthermal: -1601.843500 hartree
zpe.sumelectthermalent: -1601.842556 hartree
zpe.sumelectthermalfe: -1601.935973 hartree
dipole: -0.0210 -2.3292 -0.0094
dipole: 2.3293
quadrupole: -128.0018 -140.1668 -148.3700
quadrupole: -0.0830 7.4304 -0.0659
quadrupole: 10.8444 -1.3206 -9.5238 -0.0830 7.4304 -0.0659
hfenergy: -1602.3246168 hartree
pointgroup: C01 [X(C12H32N4O3P2)]
dipole: 0.0698597 -0.9123088 -0.0510807 debye
polarizability: 247.9638496|2.8484926|212.7964604|-9.4764155|-0.3113947|206.5326995 unknown
InChI: InChI=1S/C12H32N4O3P2/c1-9(2)13-20(17,14-10(3)4)19-21(18,15-11(5)6)16-12(7)8/h9-16H,1-8H3
charge 0 multiplicity 1
53 atoms
P  -1.394026 -0.192879 0.473702
P  1.477863 0.06041 -0.54227
O  0.105262 -0.965385 -0.080788
O  -1.089994 0.593007 1.845538
O  1.052501 0.941916 -1.820383
N  -2.578935 -1.402917 0.682601
N  -1.849142 0.62369 -0.976005
N  2.811956 -0.948287 -0.878521
N  1.835234 0.766666 0.990303
C  -2.811441 -2.098688 1.973898
C  -2.994966 1.578156 -1.0032
C  3.110855 -1.476682 -2.233884
C  2.839795 1.859967 1.130329
C  -1.973515 -3.394989 2.082054
C  -4.322131 -2.365871 2.137555
C  -3.432083 1.755031 -2.471285
C  -2.650346 2.929938 -0.329622
C  2.485046 -2.875287 -2.450675
C  4.638667 -1.484607 -2.44929
C  3.305475 1.895041 2.600167
C  2.28633 3.228787 0.661596
H  -2.482772 -1.390263 2.757712
H  -3.821043 1.100995 -0.438616
H  2.650015 -0.761124 -2.940987
H  3.701135 1.586114 0.488709
H  -2.934624 -1.849155 -0.167477
H  -1.038068 0.865088 -1.578447
H  3.24195 -1.421974 -0.079172
H  1.006007 0.827163 1.612396
H  -2.278472 -4.124867 1.307898
H  -0.900674 -3.174072 1.943686
H  -2.111693 -3.86781 3.072031
H  -4.692693 -3.043003 1.343437
H  -4.892775 -1.422783 2.086361
H  -4.52398 -2.848383 3.11081
H  -2.610456 2.192681 -3.069408
H  -3.705452 0.784216 -2.919424
H  -4.300151 2.435675 -2.536772
H  -1.828712 3.432252 -0.873903
H  -2.326668 2.768379 0.714116
H  -3.528595 3.602314 -0.329068
H  2.929429 -3.615202 -1.757737
H  1.396275 -2.84452 -2.27049
H  2.662552 -3.225029 -3.484368
H  5.136458 -2.159149 -1.725636
H  5.055949 -0.470716 -2.325338
H  4.88103 -1.845356 -3.465219
H  2.454903 2.123496 3.269982
H  3.728781 0.921207 2.900912
H  4.071733 2.678119 2.744447
H  1.423192 3.527926 1.285442
H  1.950685 3.170722 -0.389178
H  3.061729 4.013245 0.743182
