program: Gaussian 09
title: 000005401
version: EM64L-G09RevD.01
frameworkgroup: C1[X(C19H25N5O4)]
method: RPBEPBE
basis: SDD
operation: Freq
keyword: #p
keyword: freq=noraman
keyword: PBEPBE/SDD
title: #p freq=noraman PBEPBE/SDD
converged: YES YES NO NO
title: Mulliken charges:
elementType: O O O O N N N N N C C C C C C C C C C C C C C C C C C C H H H H H H H H H H H H H H H H H H H H H H H H H
charge: -0.255012 -0.284407 -0.297591 -0.302113 -0.139393 -0.136777 -0.120045 -0.107197 -0.638972 -0.145803 -0.374415 -0.429424 -0.428576 -0.333435 -0.468420 0.231513 -0.487571 -0.295224 0.031976 0.094913 0.286305 0.098377 -0.543233 -0.485713 0.255069 0.168102 -0.529944 -0.528973 0.251484 0.228953 0.239073 0.280515 0.223252 0.289565 0.218147 0.238414 0.236512 0.236066 0.224201 0.259637 0.227348 0.236453 0.202232 0.277526 0.219774 0.331578 0.329249 0.255273 0.225031 0.230400 0.221642 0.229505 0.254152
chargesum: 0.00000
title: Mulliken charges with hydrogens summed into heavy atoms:
elementType: O O O O N N N N N C C C C C C C C C C C C C C C C C C C
charge: -0.255012 -0.284407 -0.297591 -0.302113 -0.139393 -0.136777 -0.120045 -0.107197 0.021855 0.105681 0.093611 0.074343 0.079136 0.141492 -0.008153 0.231513 -0.000586 0.143461 0.031976 0.094913 0.286305 0.098377 -0.265707 -0.265940 0.255069 0.168102 0.180759 0.176326
polarizability: 4.37486298e+02 -2.61654624e+01 2.51128234e+02 1.85147621e+01 1.00533876e+01 1.61658853e+02
1716.lowfreq: -6.4302 -0.0011 -0.0004 0.0006 2.1907 5.0477 9.5096 26.1478 33.3379
frequency: 7.1169 25.9347 32.8203 39.1592 48.5105 63.3332 88.3653 91.3322 100.9584 104.8252 109.1790 146.3220 148.4223 155.1043 158.2350 166.5550 173.5764 194.3565 206.0299 217.3382 243.7908 251.2428 252.6978 288.3628 310.1478 315.5938 329.3264 339.1859 346.1516 371.4001 379.9829 384.4370 440.0662 455.2305 476.8488 494.9155 503.2762 541.6051 545.3748 558.9988 569.8742 594.3357 628.6033 648.5555 654.3306 677.6692 683.2961 704.4575 704.8432 709.8900 731.4779 780.1221 784.9865 787.8350 840.1084 852.0001 856.0738 868.0556 870.1170 873.9425 892.7345 905.7760 914.4341 919.4509 942.0003 950.8493 954.4847 979.5528 1010.2893 1034.4543 1037.2181 1054.5593 1065.6953 1077.8305 1084.2444 1087.8059 1110.1187 1114.0831 1121.3126 1129.8788 1147.3673 1150.5384 1158.5331 1164.8225 1174.3386 1188.9308 1201.0593 1207.9423 1212.7258 1225.4548 1236.6621 1241.4332 1251.7052 1272.1294 1295.5455 1298.1697 1311.9484 1320.4148 1326.0511 1332.7122 1338.6564 1343.0044 1353.5930 1359.0905 1370.8579 1383.4684 1393.6203 1422.1669 1431.5013 1455.9998 1457.0115 1460.4293 1465.2265 1467.8418 1473.2961 1476.8034 1477.9624 1481.6025 1483.4833 1485.3048 1486.6028 1498.7238 1500.6980 1531.7474 1552.4766 1582.2026 1624.1468 1628.7228 2958.1522 2969.7811 2970.7635 2973.4599 2979.1314 2987.8981 3007.3731 3011.6492 3028.5183 3032.3809 3047.8735 3060.1098 3068.6139 3070.4588 3071.1678 3077.5718 3080.5508 3082.3815 3104.4398 3120.7227 3122.9007 3132.5898 3178.1762 3554.6014 3710.4341
redmass: 5.0555 4.5365 4.2622 4.2088 6.3220 3.6536 3.3047 3.3903 2.7132 3.2518 4.0331 2.7810 2.2467 1.4112 2.4179 1.3320 2.9982 4.0236 4.5237 4.6970 5.0214 3.2083 4.3607 4.6234 4.5634 4.1931 3.3190 4.1838 3.0336 2.3076 4.2930 1.8738 2.9166 5.2276 3.5807 3.9350 4.0067 2.3604 1.8285 4.7682 3.2796 3.2189 3.0745 3.3980 5.5614 4.4487 5.6200 6.1545 8.6925 6.6991 3.3074 4.1872 4.8700 2.9117 1.9772 4.1788 1.8319 1.8178 3.4303 2.9191 1.6084 2.2577 3.6082 2.6982 3.5910 2.4053 3.4708 2.3217 2.3796 4.2120 2.2032 2.5507 3.6713 1.9548 2.0048 1.6255 1.2643 1.2471 1.8212 3.0554 1.1533 1.3912 1.7080 1.7813 2.2911 2.1728 1.2574 1.2426 1.5424 1.4169 1.5008 2.2635 1.5258 1.9312 1.4890 3.6748 1.2244 1.3670 3.1811 1.4573 1.3316 1.7943 1.6131 1.6409 2.4911 5.3498 2.4059 1.2262 1.2844 1.3571 1.0571 1.0934 2.1888 1.0937 1.3950 1.0788 1.1565 1.2110 1.2943 1.2371 1.2418 1.6520 2.0744 4.6395 7.3329 7.2475 1.4167 7.2544 1.0700 1.0600 1.0310 1.0309 1.0699 1.0621 1.0582 1.0592 1.1021 1.0629 1.0998 1.0866 1.1035 1.1063 1.1041 1.1059 1.0930 1.0944 1.1067 1.1029 1.1028 1.0909 1.0923 1.0455 1.1036
irintensity: 0.3378 0.7751 2.3888 0.6250 2.2901 7.2701 1.0383 2.6214 7.5320 2.2979 8.2270 0.3461 0.7820 2.9935 2.5663 0.3904 10.8547 4.9265 0.7308 1.6654 8.8839 3.5240 5.1788 7.4292 1.3876 0.5364 1.7905 8.7050 5.3790 40.8738 4.4353 54.9057 70.5998 9.1043 24.5632 5.4003 5.8264 30.5817 50.4834 14.3135 6.7965 4.3019 10.5828 12.9135 10.8146 2.2340 6.0795 9.7544 2.7265 9.0823 9.0923 14.7789 18.4540 4.5367 0.9716 10.7918 2.8309 15.2806 8.5892 6.3264 20.3194 14.7681 28.1140 22.8150 81.3055 0.3394 77.6456 47.4433 58.1153 115.0195 8.6984 16.3185 33.7116 8.7977 34.4207 5.0789 37.5958 8.9911 20.3408 27.5689 15.6150 1.5671 18.1044 42.4532 17.8610 96.3555 75.9669 4.1026 125.6719 15.6425 57.1577 26.8143 16.7015 177.9168 2.0494 10.3696 2.1761 48.2376 18.7205 6.4946 10.3437 72.3928 11.8836 126.0597 31.1326 14.5372 164.0770 5.1407 19.6639 38.6957 18.9775 6.5982 102.3467 27.9953 536.0351 6.1060 77.6452 33.8249 149.2403 13.6017 121.8099 16.8961 15.6634 343.0342 743.6577 212.6239 356.3457 124.0106 46.1329 34.1342 88.8495 82.8893 31.9975 51.1677 85.5650 20.2703 64.8981 42.3268 30.3144 25.2445 29.0830 15.8011 21.9849 7.9687 15.9442 4.5767 55.7025 29.0505 25.6269 11.9420 0.9770 81.0162 31.1811
temp: 298.150 k
press: 1.00000 atm
elementType: 8 8 8 8 7 7 7 7 7 6 6 6 6 6 6 6 6 6 6 6 6 6 6 6 6 6 6 6 1 1 1 1 1 1 1 1 1 1 1 1 1 1 1 1 1 1 1 1 1 1 1 1 1
symmnumber: 1
zpe: 1127001.2 jmol-1
zpe.correction: 0.429252 hartree
zpe.thermalcorrener: 0.456239 hartree
zpe.thermalcorrenthalpy: 0.457183 hartree
zpe.thermalcorrgfe: 0.369487 hartree
zpe.sumelectzpe: -1311.560249 hartree
zpe.sumelectthermal: -1311.533262 hartree
zpe.sumelectthermalent: -1311.532317 hartree
zpe.sumelectthermalfe: -1311.620014 hartree
dipole: 4.4281 -0.5075 -1.3476
dipole: 4.6564
quadrupole: -155.1372 -149.5509 -165.9083
quadrupole: 21.1043 16.1393 4.7406
quadrupole: 1.7283 7.3146 -9.0428 21.1043 16.1393 4.7406
hfenergy: -1311.9895009 hartree
pointgroup: C01 [X(C19H25N5O4)]
dipole: -1.7389351 -0.2530714 0.5178016 debye
polarizability: 437.3511012|25.5436996|252.4572662|19.6705985|-2.4215156|160.4650173 unknown
InChI: InChI=1S/C19H25N5O4/c1-26-15-10-12-13(11-16(15)27-2)21-19(22-17(12)20)24-7-5-23(6-8-24)18(25)14-4-3-9-28-14/h10-11,14H,3-9,20H2,1-2H3
charge 0 multiplicity 1
53 atoms
O  6.531639 -0.433828 -1.877353
O  5.776674 1.227234 0.294872
O  -5.622332 -2.499674 -0.121037
O  -6.788587 0.139443 -0.543587
N  3.701719 0.174715 0.406229
N  0.862936 0.496351 0.730053
N  -1.253551 -0.502818 0.453317
N  -0.947372 1.930427 0.341609
N  -2.697295 3.408644 -0.019325
C  5.551333 -0.909544 -0.898703
C  2.769719 -0.93249 0.05431
C  3.151568 1.276565 1.233723
C  1.482884 -0.828188 0.893525
C  1.748443 1.684369 0.757412
C  6.342172 -1.9266 -0.027886
C  5.018849 0.258036 -0.031778
C  7.730513 -1.238274 0.097741
C  7.876681 -0.445892 -1.230802
C  -0.495849 0.626451 0.499301
C  -2.605001 -0.321455 0.21535
C  -3.19447 0.987358 0.035338
C  -2.26922 2.1070 0.122325
C  -3.46061 -1.465984 0.166685
C  -4.589106 1.103857 -0.228152
C  -4.830939 -1.331353 -0.062072
C  -5.40465 -0.028581 -0.293701
C  -6.681174 -2.587395 0.913336
C  -7.251606 -0.441693 -1.827036
H  4.745145 -1.381496 -1.483886
H  3.241514 -1.913743 0.251758
H  2.505157 -0.888022 -1.021266
H  3.850434 2.124863 1.148058
H  3.123807 0.976229 2.300275
H  0.746111 -1.580156 0.568852
H  1.712069 -1.024989 1.961176
H  1.327856 2.449502 1.434384
H  1.802675 2.142038 -0.249742
H  6.424975 -2.880261 -0.579259
H  5.875773 -2.122789 0.953472
H  7.730156 -0.541318 0.951261
H  8.540705 -1.97373 0.238327
H  8.186008 0.597535 -1.051316
H  8.561739 -0.928442 -1.951445
H  -3.030814 -2.457896 0.327143
H  -5.073415 2.070956 -0.406001
H  -1.99904 4.146459 0.046986
H  -3.673057 3.647422 -0.162591
H  -7.355709 -1.714053 0.864713
H  -6.220452 -2.653875 1.916991
H  -7.229651 -3.515068 0.690568
H  -6.759655 0.071029 -2.675529
H  -8.336858 -0.260319 -1.856822
H  -7.037535 -1.524761 -1.868305
