program: Gaussian 09
title: 000040714
version: EM64L-G09RevD.01
frameworkgroup: C1[X(C10H19NO)]
method: RPBEPBE
basis: SDD
operation: Freq
keyword: #p
keyword: freq=noraman
keyword: PBEPBE/SDD
title: #p freq=noraman PBEPBE/SDD
converged: YES YES NO NO
title: Mulliken charges:
elementType: O N C C C C C C C C C C H H H H H H H H H H H H H H H H H H H
charge: -0.447700 -0.115101 -0.371412 -0.386443 -0.316944 -0.316286 -0.466280 -0.675829 -0.678233 0.066893 -0.038216 -0.404469 0.192672 0.237087 0.206735 0.194638 0.185219 0.202140 0.184456 0.194725 0.221132 0.253489 0.222059 0.210258 0.204079 0.213993 0.253134 0.196311 0.218069 0.217320 0.342504
chargesum: 0.00000
title: Mulliken charges with hydrogens summed into heavy atoms:
elementType: O N C C C C C C C C C C
charge: -0.105196 -0.115101 0.058348 0.014929 0.070416 0.062894 0.008341 -0.039433 -0.014795 0.066893 -0.038216 0.030920
polarizability: 1.49942286e+02 -1.38119222e+01 1.15880627e+02 -2.47173986e+00 1.74322034e+00 9.33764560e+01
1716.lowfreq: -18.3946 -7.5460 -6.0011 -0.0010 -0.0006 -0.0002 22.8846 27.2496 34.2042
frequency: 22.3873 27.0245 34.0933 68.3517 73.4282 83.5031 125.1361 143.4255 191.9301 205.5517 213.0720 228.1389 274.1720 289.6768 298.9173 327.5638 351.8058 425.3548 451.8764 458.9743 491.3055 553.0936 686.4192 722.2033 787.5698 795.8562 815.6915 861.6154 908.4039 920.6060 944.0971 994.0721 1010.4503 1024.6827 1058.2156 1072.1532 1081.1203 1084.1806 1107.9032 1130.0281 1152.8594 1180.2926 1194.0692 1205.9578 1220.1559 1237.1375 1276.7841 1282.9852 1288.6686 1316.3875 1340.7116 1358.9359 1365.5723 1373.1972 1386.0319 1393.4616 1399.9318 1447.2439 1454.7102 1460.9924 1462.5387 1462.9119 1471.5116 1478.1864 1482.4827 1487.1833 1492.6161 2285.1439 2845.5440 2852.1298 2868.6474 2932.8427 2974.2597 2977.2905 2981.9152 2982.7720 2988.3779 3021.6427 3029.6443 3031.3755 3039.6777 3053.7493 3074.9730 3076.0160 3088.3723 3091.7169 3535.4371
redmass: 4.3263 3.8043 3.4613 2.6483 2.9185 1.9752 2.2558 3.9873 1.4237 1.2336 1.2379 1.7908 2.8525 2.0944 1.9552 3.6889 2.1688 2.6713 3.2227 2.5272 3.5830 4.0335 2.4010 3.1702 1.1959 1.1483 1.5850 2.6718 2.1022 6.3893 1.9251 1.6225 1.7292 2.2167 2.5430 1.8602 2.2284 2.2896 1.9932 1.7742 1.4716 1.3308 1.0583 1.9473 1.3382 1.6008 1.1370 1.2259 1.2319 1.4070 1.3975 1.3356 1.3227 1.3766 1.2322 1.2307 1.4270 1.0942 1.0895 1.0550 1.0805 1.0637 1.0613 1.0639 1.0681 1.0588 1.0699 11.7255 1.0720 1.0719 1.0711 1.0540 1.1055 1.0583 1.0357 1.0366 1.0612 1.0866 1.0985 1.0869 1.0942 1.0970 1.0982 1.0981 1.1003 1.1004 1.0662
irintensity: 0.5948 3.2503 2.1889 3.3533 0.7796 0.3096 7.3723 9.5594 48.8051 79.5050 34.1355 5.4200 1.5702 0.8482 1.6809 3.3024 2.6805 6.1972 3.7584 3.5512 0.5414 6.4024 11.3336 13.8587 2.8888 3.7464 12.1389 3.3758 1.8659 69.9755 10.6296 0.9451 10.5591 16.6371 14.2469 12.9450 16.5714 8.4284 12.8796 22.7079 29.2270 7.1251 0.0914 19.2101 25.7262 11.9978 3.0698 14.4311 21.1070 9.3856 13.5709 1.4596 3.3239 0.5515 23.0643 8.4487 36.2764 13.6153 5.8560 6.3015 0.9187 2.3638 5.0987 5.0512 13.8609 9.8402 17.7759 30.2118 33.7737 79.1701 218.3205 86.9565 38.4075 26.3156 36.2817 29.4881 46.2797 16.8455 10.1277 32.6238 18.2570 48.9634 53.9436 44.0690 49.3230 33.1855 9.3553
temp: 298.150 k
press: 1.00000 atm
elementType: 8 7 6 6 6 6 6 6 6 6 6 6 1 1 1 1 1 1 1 1 1 1 1 1 1 1 1 1 1 1 1
symmnumber: 1
zpe: 710277.3 jmol-1
zpe.correction: 0.270530 hartree
zpe.thermalcorrener: 0.286357 hartree
zpe.thermalcorrenthalpy: 0.287301 hartree
zpe.thermalcorrgfe: 0.225239 hartree
zpe.sumelectzpe: -521.357148 hartree
zpe.sumelectthermal: -521.341321 hartree
zpe.sumelectthermalent: -521.340377 hartree
zpe.sumelectthermalfe: -521.402440 hartree
dipole: -1.0553 -0.4325 0.3187
dipole: 1.1842
quadrupole: -56.2301 -72.6102 -76.3859
quadrupole: -3.5423 1.0641 -0.0801
quadrupole: 12.1786 -4.2015 -7.9771 -3.5423 1.0641 -0.0801
hfenergy: -521.6276784 hartree
pointgroup: C01 [X(C10H19N1O1)]
dipole: 0.4256843 -0.1140235 -0.1511964 debye
polarizability: 146.276327|17.3317296|119.517047|-3.2900342|-0.9517737|93.4059944 unknown
InChI: InChI=1S/C10H19NO/c1-3-11(4-2)9-7-5-6-8-10-12/h12H,3-5,7,9-10H2,1-2H3
charge 0 multiplicity 1
31 atoms
O  3.446454 1.840088 -0.467345
N  -1.798186 0.159408 -0.168367
C  -0.878033 -0.411004 -1.189132
C  -0.37208 -1.821785 -0.811376
C  -3.186356 -0.358836 -0.308621
C  -1.746259 1.648265 -0.113154
C  0.474819 -1.81248 0.49293
C  -3.98694 -0.306701 1.007356
C  -0.482959 2.188761 0.58421
C  1.720642 -1.037575 0.3552
C  2.729028 -0.3416 0.205883
C  3.902697 0.518608 0.036355
H  -1.35948 -0.44907 -2.198476
H  -0.00165 0.255202 -1.281442
H  0.230317 -2.225168 -1.648395
H  -1.228763 -2.508227 -0.66407
H  -3.744095 0.186681 -1.113006
H  -3.122394 -1.412971 -0.637731
H  -1.832042 2.091682 -1.138498
H  -2.633546 1.992705 0.449649
H  0.710504 -2.851299 0.797237
H  -0.146281 -1.361197 1.291377
H  -3.471447 -0.892454 1.788623
H  -4.100317 0.72734 1.37993
H  -5.001574 -0.723075 0.861358
H  -0.421792 1.794435 1.614144
H  0.447798 1.90723 0.061608
H  -0.518103 3.293926 0.631193
H  4.423846 0.633457 1.011478
H  4.610042 0.054882 -0.684977
H  4.239848 2.431174 -0.550641
