program: Gaussian 09
title: 000005387
version: EM64L-G09RevD.01
frameworkgroup: C1[X(C19H22N4O2S)]
method: RPBEPBE
basis: SDD
operation: Freq
keyword: #p
keyword: freq=noraman
keyword: PBEPBE/SDD
title: #p freq=noraman PBEPBE/SDD
converged: YES YES NO NO
title: Mulliken charges:
elementType: S O O N N N N C C C C C C C C C C C C C C C C C C C H H H H H H H H H H H H H H H H H H H H H H
charge: 0.290377 -0.223811 -0.255737 -0.068910 -0.064771 -0.345050 -0.449288 -0.360686 -0.360718 -0.394937 -0.377512 -0.443623 0.148529 -0.614646 0.438233 0.301455 0.342428 0.321505 -0.278431 0.022931 -0.359521 -0.698175 -0.395793 -0.749493 -0.248726 -0.220327 0.250889 0.180229 0.185977 0.198741 0.196944 0.206482 0.202823 0.188326 0.221262 0.250332 0.220043 0.187364 0.222951 0.259271 0.327829 0.298392 0.239605 0.228354 0.279863 0.225622 0.237742 0.235657
chargesum: 0.00000
title: Mulliken charges with hydrogens summed into heavy atoms:
elementType: S O O N N N N C C C C C C C C C C C C C C C C C C C
charge: 0.290377 -0.223811 -0.255737 -0.068910 -0.064771 -0.345050 -0.121459 0.070431 0.024000 0.008489 0.013637 0.027971 0.148529 0.015712 0.438233 0.301455 0.342428 0.321505 -0.278431 0.022931 -0.100250 -0.399783 -0.156187 -0.015653 -0.010984 0.015330
polarizability: 2.55798242e+02 1.68704065e+01 2.80436001e+02 -2.62168038e+01 -2.55781466e+00 2.31344337e+02
1716.lowfreq: -12.9464 -7.5660 -4.1323 -0.0019 -0.0013 0.0010 15.9236 20.7921 35.0523
frequency: 15.6992 18.0519 34.9706 51.0663 63.2817 78.2694 91.8015 99.3595 108.5900 119.6699 145.1737 160.8491 172.4709 217.0612 221.0106 229.6073 233.1103 253.3989 278.3169 293.8397 300.4546 309.4159 322.6180 341.5533 358.0538 361.5439 384.4862 392.2026 418.4271 441.4645 468.4952 480.6573 488.2310 496.5454 533.1778 542.9296 566.6019 595.7800 605.5839 625.3605 632.0325 669.3538 690.2460 707.9557 732.7932 739.4977 741.0767 755.3018 766.6107 790.9541 795.0742 810.8981 846.7412 856.0454 861.4659 881.4218 918.3381 947.0483 955.6093 975.8707 979.1507 981.6470 1010.1912 1031.2855 1035.7017 1040.0894 1049.6312 1071.4821 1079.9133 1081.7648 1112.2056 1125.2056 1133.1193 1140.7192 1147.6711 1163.1037 1173.3522 1178.2364 1196.8508 1205.1081 1215.0516 1242.2410 1248.9158 1263.9496 1281.4743 1282.3252 1293.6644 1309.8103 1318.2799 1334.8587 1344.8919 1367.7863 1372.7669 1372.8631 1387.9251 1397.0723 1401.4402 1413.1487 1427.9693 1435.2855 1448.0759 1451.9067 1453.6796 1457.6066 1458.8969 1464.4772 1465.3313 1474.2124 1480.7324 1491.6844 1503.1080 1579.2704 1588.3456 1604.3802 1609.7724 1622.8528 2811.7121 2845.5352 2852.4512 2861.7109 2864.9641 2879.1209 2985.4068 3016.0336 3018.4152 3021.2205 3024.9065 3032.5126 3071.3894 3074.3670 3083.4117 3089.9304 3127.3760 3137.1854 3151.4003 3171.6930 3243.5797 3491.9506
redmass: 4.2361 3.2166 5.3687 7.2322 4.6386 4.6338 5.5701 1.2235 3.0228 3.6071 3.9569 4.4822 4.6549 2.1954 1.7240 2.5993 3.9323 2.1226 3.4607 3.7292 3.8562 4.6629 2.5420 6.6881 4.6943 3.3150 5.2626 2.2604 6.7291 4.9346 4.8463 3.2798 3.1721 5.4996 3.8910 5.3074 4.8537 3.4339 3.6943 2.5698 5.4833 6.2350 2.8068 3.2724 2.7165 2.5282 3.3380 3.3548 1.3490 3.5204 2.6156 4.5422 1.6534 3.3298 1.7256 3.2090 2.1832 1.3823 5.4724 2.1668 3.3852 1.3409 2.3880 2.3679 1.4485 2.0753 1.5993 1.6858 2.0459 1.7048 1.7620 1.6249 2.0894 2.7005 2.6674 3.3103 1.0634 2.7042 1.1263 1.6474 2.2751 2.2430 2.6870 1.8999 1.8671 1.6604 1.5216 1.3493 4.0510 1.4513 1.3498 1.4812 1.8405 2.8305 1.5006 1.9254 2.1048 2.2938 1.1684 1.1047 1.0757 1.0782 1.0811 2.6681 1.0672 1.0646 1.0999 1.1101 1.0531 2.9538 7.5807 8.3388 8.4390 5.8808 4.9685 7.4056 1.0706 1.0671 1.0642 1.0673 1.0692 1.0674 1.0358 1.0728 1.0906 1.0836 1.0871 1.0902 1.0977 1.1009 1.0883 1.0999 1.0878 1.0888 1.0938 1.1007 1.0960 1.0748
irintensity: 0.1509 0.2352 0.6051 2.2263 0.2337 0.3685 0.5913 0.5129 0.5000 6.6323 0.2756 0.4965 0.2249 1.4587 0.6128 0.6883 2.5272 3.0009 3.6956 9.0935 1.0605 8.4108 12.1297 1.0055 2.5860 0.0430 1.1807 0.5440 0.6571 6.4695 0.3060 6.0142 3.5502 3.8276 2.4163 12.3665 12.7881 5.5513 10.7529 6.2154 9.5455 5.6254 3.1280 5.0501 4.9513 26.6758 61.2750 26.9481 116.3700 12.0712 4.5240 23.0003 0.7174 1.5287 2.7702 11.1357 6.4928 0.9928 7.9246 0.9819 13.2970 0.0629 53.3583 2.5964 3.5458 3.4049 4.0526 4.7395 1.8964 0.4502 28.5240 35.7257 36.9929 36.2047 29.8523 185.9748 0.6362 46.2849 5.6680 21.6616 97.0782 55.4769 82.1233 16.0791 6.6673 31.0328 25.0280 8.9521 305.5198 8.9246 3.7267 7.0942 12.4622 23.7950 9.2590 31.8197 13.4570 11.5469 1.7054 10.6093 18.1253 0.7568 0.9735 22.0889 31.5475 22.7146 19.0699 7.6416 8.6649 145.6739 55.6778 53.9256 112.2841 134.5646 122.8235 178.1541 91.7712 60.0110 91.1088 34.0579 33.9865 269.0854 17.5524 47.0382 28.1702 29.2612 70.0510 34.0146 7.6519 34.6137 9.3436 17.0783 5.8788 3.0949 16.1264 17.7215 7.3447 30.6882
temp: 298.150 k
press: 1.00000 atm
elementType: 16 8 8 7 7 7 7 6 6 6 6 6 6 6 6 6 6 6 6 6 6 6 6 6 6 6 1 1 1 1 1 1 1 1 1 1 1 1 1 1 1 1 1 1 1 1 1 1
symmnumber: 1
zpe: 1002783.3 jmol-1
zpe.correction: 0.381940 hartree
zpe.thermalcorrener: 0.406022 hartree
zpe.thermalcorrenthalpy: 0.406966 hartree
zpe.thermalcorrgfe: 0.326675 hartree
zpe.sumelectzpe: -1502.815050 hartree
zpe.sumelectthermal: -1502.790967 hartree
zpe.sumelectthermalent: -1502.790023 hartree
zpe.sumelectthermalfe: -1502.870315 hartree
dipole: 0.5372 4.4047 -3.2727
dipole: 5.5137
quadrupole: -159.1486 -147.3133 -162.6636
quadrupole: -2.9738 5.4938 1.3001
quadrupole: -2.7735 9.0619 -6.2884 -2.9738 5.4938 1.3001
hfenergy: -1503.1969897 hartree
pointgroup: C01 [X(C19H22N4O2S1)]
dipole: 0.0133611 1.9157917 -1.017436 debye
polarizability: 254.3474409|15.8599368|285.6854082|-21.8081973|2.6587856|227.5457307 unknown
InChI: InChI=1S/C19H22N4O2S/c1-13-18-14(12-26-13)19(25)20-15-5-3-4-6-16(15)23(18)17(24)11-22-9-7-21(2)8-10-22/h3-6,12,20H,7-11H2,1-2H3
charge 0 multiplicity 1
48 atoms
S  -3.311599 -3.426294 -1.315943
O  0.858751 -1.733854 -0.79055
O  -3.306257 -1.268463 2.793392
N  2.792468 0.253254 -0.134616
N  5.434698 0.142322 1.053259
N  -0.9304 -0.244274 -0.647636
N  -2.409144 0.569335 1.735878
C  3.076111 -0.634278 1.024209
C  3.676296 1.445779 -0.108463
C  4.55392 -1.051147 1.022517
C  5.152454 1.016795 -0.108569
C  1.381706 0.630162 -0.259926
C  0.456583 -0.556115 -0.602555
C  6.862425 -0.21434 1.152385
C  -1.902686 -1.302148 -0.677897
C  -1.443614 1.10022 -0.503599
C  -2.795994 -1.536833 0.446015
C  -2.148015 1.477965 0.67455
C  -2.03309 -2.207391 -1.720143
C  -2.84879 -0.772908 1.718319
C  -1.252311 2.042768 -1.539821
C  -3.613636 -2.640692 0.254518
C  -2.574241 2.825939 0.816605
C  -1.25007 -2.307332 -2.993666
C  -1.681283 3.378272 -1.393589
C  -2.331251 3.770868 -0.199537
H  2.444115 -1.532625 0.939623
H  2.84662 -0.115485 1.989687
H  3.489493 2.077521 0.797124
H  3.474251 2.061095 -1.006293
H  4.746757 -1.679657 0.116633
H  4.760852 -1.666335 1.9181
H  5.795273 1.915227 -0.043233
H  5.375706 0.49971 -1.077416
H  0.970274 1.117731 0.665358
H  1.298055 1.39097 -1.058243
H  7.471917 0.703732 1.237281
H  7.236513 -0.797889 0.27232
H  7.031009 -0.821697 2.05989
H  -0.755424 1.714192 -2.45935
H  -2.56235 0.991244 2.658842
H  -4.348918 -3.043505 0.94751
H  -3.113296 3.122819 1.724332
H  -0.90778 -1.303504 -3.302664
H  -0.344306 -2.922778 -2.842881
H  -1.847059 -2.740416 -3.814647
H  -1.516354 4.100351 -2.199316
H  -2.668378 4.80449 -0.068994
