program: Gaussian 09
title: 000040724
version: EM64L-G09RevD.01
frameworkgroup: C1[X(C13H25NO)]
method: RPBEPBE
basis: SDD
operation: Freq
keyword: #p
keyword: freq=noraman
keyword: PBEPBE/SDD
title: #p freq=noraman PBEPBE/SDD
converged: YES YES NO NO
title: Mulliken charges:
elementType: O N C C C C C C C C C C C C C H H H H H H H H H H H H H H H H H H H H H H H H H
charge: -0.451155 -0.102818 -0.413533 -0.380419 0.217243 -0.324781 -0.324525 -0.719108 -0.677226 -0.675143 -0.052533 -0.463530 -0.028094 -0.352770 -0.681694 0.216317 0.207783 0.227134 0.166993 0.186052 0.210739 0.184195 0.202097 0.212171 0.228372 0.238565 0.228273 0.206862 0.206203 0.228044 0.215215 0.204508 0.326994 0.237370 0.229337 0.210925 0.203372 0.217732 0.208157 0.226675
chargesum: 0.00000
title: Mulliken charges with hydrogens summed into heavy atoms:
elementType: O N C C C C C C C C C C C C C
charge: -0.124161 -0.102818 0.010567 0.013709 0.217243 0.072010 0.061766 -0.040000 -0.035888 -0.027376 -0.052533 0.003177 -0.028094 0.061528 -0.029131
polarizability: 1.79556960e+02 -1.42734698e+01 1.61806997e+02 -3.23125354e+00 -6.36377971e-01 1.22267734e+02
1716.lowfreq: -5.8172 -2.6982 -0.0007 -0.0004 0.0004 14.4266 23.4401 24.7996 35.8628
frequency: 22.9899 23.6647 35.8464 58.6561 64.5927 83.8447 87.5690 91.7869 125.6605 141.1231 156.5092 190.0037 196.8715 201.5663 238.1907 246.0995 273.8692 274.3581 288.7910 313.1936 329.4156 331.9464 354.8223 390.3383 418.8577 446.3314 475.6653 492.3333 552.7983 574.1616 641.3377 745.1500 764.2633 777.4226 795.8533 799.0403 829.4265 850.0636 876.9801 908.4268 919.0564 972.3817 997.1514 1017.3500 1032.9261 1062.6173 1073.5236 1075.8551 1083.0615 1084.7469 1091.4327 1098.3835 1106.9342 1138.2435 1158.3582 1203.0631 1216.1100 1222.9510 1254.2600 1257.4792 1264.0093 1284.0402 1290.3631 1304.8042 1316.0364 1328.1957 1342.7688 1362.1852 1368.2968 1375.4114 1384.4479 1386.4396 1387.3390 1387.6146 1440.5407 1452.8055 1457.0690 1460.9233 1462.7636 1468.0418 1470.8035 1471.6073 1476.4018 1477.8554 1479.5852 1485.1351 1486.8733 1490.6451 2260.5983 2821.3555 2845.1396 2857.4905 2966.6298 2976.1992 2981.7775 2983.0199 2986.7457 2997.3945 3002.0900 3017.4158 3031.1473 3035.1284 3040.1083 3041.0313 3067.9705 3073.4575 3074.7321 3075.3973 3078.3587 3090.8629 3091.5431 3101.1983 3112.3015 3543.8435
redmass: 3.2784 2.8652 3.6992 3.3734 2.3674 2.4259 2.1216 2.8615 2.6528 1.9296 1.8810 1.6138 1.3481 1.1463 1.2997 1.8475 2.1766 1.3628 1.7985 3.0866 2.1628 2.7916 2.8470 3.5343 3.0362 2.9201 2.7472 3.1216 4.9653 4.3642 2.8746 2.5418 1.6817 1.2902 1.1933 1.1860 2.2912 2.1527 1.4783 1.9971 1.8830 2.4718 2.0096 1.4898 2.2337 2.3121 1.9019 1.9979 1.8214 2.2665 2.6795 1.7495 1.9445 2.0661 1.9121 2.2575 2.3107 1.2559 1.6296 1.2505 1.2937 1.1886 1.2676 1.1925 1.3469 1.6923 1.4222 1.3234 1.3396 1.2543 1.3405 1.2492 1.2307 1.2382 1.0791 1.0863 1.0571 1.0577 1.0560 1.0671 1.0494 1.0563 1.0449 1.0602 1.0637 1.0621 1.0686 1.0753 11.8359 1.0711 1.0723 1.0712 1.0589 1.0354 1.0357 1.0357 1.0626 1.0382 1.0558 1.0981 1.0864 1.0873 1.0864 1.1012 1.1019 1.0982 1.1003 1.0980 1.1000 1.1002 1.1002 1.1003 1.1007 1.0659
irintensity: 0.1359 0.1795 0.1752 0.0622 0.1747 0.9466 0.2695 0.0324 3.3667 1.5693 2.1472 3.3705 0.1626 5.7821 0.8659 0.2785 25.9838 101.3712 27.8102 7.9814 24.7885 9.3172 10.7156 8.7739 7.6466 1.5663 6.5792 0.4506 9.1283 8.5445 14.6078 11.0183 5.4791 12.9922 2.6625 6.6468 10.2760 12.0852 9.6432 4.5818 8.7242 7.7705 9.0762 9.2692 31.4598 24.7454 13.0391 3.8035 0.1555 1.9959 27.5942 1.3854 32.3448 14.0590 19.6186 37.8573 36.5263 0.4364 6.7934 1.0466 38.3671 14.2984 7.1962 30.3796 11.4165 38.5656 11.7417 2.1193 7.2103 21.5434 6.9173 21.9014 15.4308 8.8749 4.1752 7.8461 5.4164 1.8105 3.4171 7.0725 6.2478 1.2117 11.5718 2.3288 7.5951 17.7033 8.3592 11.0195 9.9779 71.1967 31.9673 212.3614 26.9759 30.8409 31.8599 34.4319 40.9115 7.8198 32.4136 27.5107 7.7321 18.7856 13.6508 11.7773 22.3525 59.9761 58.6706 68.2622 69.7067 32.8584 47.4189 30.2862 23.4828 4.2378
temp: 298.150 k
press: 1.00000 atm
elementType: 8 7 6 6 6 6 6 6 6 6 6 6 6 6 6 1 1 1 1 1 1 1 1 1 1 1 1 1 1 1 1 1 1 1 1 1 1 1 1 1
symmnumber: 1
zpe: 927414.8 jmol-1
zpe.correction: 0.353234 hartree
zpe.thermalcorrener: 0.373415 hartree
zpe.thermalcorrenthalpy: 0.374359 hartree
zpe.thermalcorrgfe: 0.302874 hartree
zpe.sumelectzpe: -639.041288 hartree
zpe.sumelectthermal: -639.021106 hartree
zpe.sumelectthermalent: -639.020162 hartree
zpe.sumelectthermalfe: -639.091648 hartree
dipole: 0.4828 -2.3761 0.0665
dipole: 2.4256
quadrupole: -86.7817 -99.2138 -94.9526
quadrupole: -4.4640 -3.0277 -4.5962
quadrupole: 6.8677 -5.5644 -1.3033 -4.4640 -3.0277 -4.5962
hfenergy: -639.3945214 hartree
pointgroup: C01 [X(C13H25N1O1)]
dipole: 0.1828486 -0.9353228 0.0490164 debye
polarizability: 179.3543808|-14.4747951|161.9689217|-2.7712238|-1.5960304|122.308388 unknown
InChI: InChI=1S/C13H25NO/c1-5-8-9-10-13(4,15)11-12-14(6-2)7-3/h15H,5-8,11-12H2,1-4H3
charge 0 multiplicity 1
40 atoms
O  0.486036 2.55651 1.315256
N  -2.373458 -0.547585 0.013955
C  -0.753146 1.31436 -0.4643
C  -1.06358 0.055975 0.371781
C  0.580765 2.022108 -0.080691
C  -3.518482 0.16865 0.641901
C  -2.414849 -2.015383 0.257629
C  0.797096 3.284123 -0.940522
C  -4.834601 0.004555 -0.142016
C  -1.647668 -2.824254 -0.805898
C  1.735514 1.096466 -0.192091
C  3.874012 -0.556942 -0.40153
C  2.706821 0.338659 -0.291823
C  3.871377 -1.725088 0.628415
C  2.682206 -2.690905 0.450061
H  -0.720758 1.021178 -1.529871
H  -1.560323 2.062187 -0.348098
H  -0.270105 -0.689024 0.183724
H  -1.022043 0.301458 1.46642
H  -3.665689 -0.156184 1.704097
H  -3.264905 1.24379 0.680598
H  -2.029879 -2.269604 1.278806
H  -3.474394 -2.329021 0.237015
H  0.851448 3.021872 -2.010796
H  -0.043532 3.981275 -0.77963
H  1.732242 3.786718 -0.645036
H  -4.708483 0.373621 -1.174651
H  -5.156182 -1.051454 -0.196109
H  -5.647473 0.576508 0.343647
H  -2.062147 -2.61961 -1.808293
H  -0.572427 -2.569086 -0.824646
H  -1.730265 -3.908269 -0.600763
H  0.503173 1.78659 1.940908
H  4.800489 0.038245 -0.27633
H  3.909732 -0.981021 -1.425846
H  3.862106 -1.302027 1.650982
H  4.824066 -2.279158 0.517666
H  2.718373 -3.508046 1.193199
H  2.687527 -3.147147 -0.557919
H  1.722008 -2.15784 0.575297
