program: Gaussian 09
title: 000005344
version: EM64L-G09RevD.01
frameworkgroup: C1[X(C11H13N3O3S)]
method: RPBEPBE
basis: SDD
operation: Freq
keyword: #p
keyword: freq=noraman
keyword: PBEPBE/SDD
title: #p freq=noraman PBEPBE/SDD
converged: YES YES NO NO
title: Mulliken charges:
elementType: S O O O N N N C C C C C C C C C C C H H H H H H H H H H H H H
charge: 0.909576 -0.204117 -0.538961 -0.516633 -0.479890 -0.059371 -0.684645 -0.092982 0.176157 0.107135 0.154500 -0.213315 -0.179128 -0.763034 -0.385034 -0.389040 0.515372 -0.744049 0.301400 0.279156 0.277790 0.224652 0.239449 0.243576 0.230921 0.232833 0.234126 0.253277 0.237793 0.315541 0.316943
chargesum: 0.00000
title: Mulliken charges with hydrogens summed into heavy atoms:
elementType: S O O O N N N C C C C C C C C C C C
charge: 0.909576 -0.204117 -0.538961 -0.516633 -0.178490 -0.059371 -0.052161 -0.092982 0.176157 0.107135 0.154500 0.065841 0.098662 -0.055356 -0.154112 -0.156207 0.515372 -0.018853
polarizability: 3.23555103e+02 -2.20925818e+00 1.89996160e+02 -1.13339811e+01 -1.23145653e+01 1.15978045e+02
1716.lowfreq: -10.1467 -7.8635 -5.2533 -0.0012 0.0013 0.0015 12.5627 20.4195 24.8445
frequency: 12.2713 20.3136 24.7540 57.4928 68.4479 70.8352 116.5249 125.3328 130.0460 144.7304 164.9280 225.4854 229.7041 245.1190 276.2955 286.7289 310.8949 315.5072 382.9667 396.4904 409.8169 412.2378 414.7979 423.3270 442.9949 485.5039 519.9824 566.8229 603.5434 618.3035 621.2815 675.1773 690.9281 718.9271 748.9841 769.2464 799.2443 811.2818 813.6778 833.5899 855.9546 924.9441 934.0505 954.1691 965.1720 980.2558 993.6228 1023.0259 1028.7591 1042.8342 1049.9752 1050.8388 1132.7438 1135.2777 1186.0696 1227.1792 1295.5123 1301.4947 1324.4510 1384.2944 1397.4919 1400.2168 1409.5814 1438.2649 1448.0743 1460.9082 1466.9282 1473.5948 1480.2212 1488.9450 1569.6138 1582.7860 1613.9745 1649.8574 2974.0697 2988.0719 3054.1994 3068.7936 3076.3537 3108.3173 3135.9657 3139.7884 3165.3198 3170.4781 3376.3561 3561.3007 3700.2565
redmass: 5.0772 4.9608 4.0960 3.8615 1.6546 2.1494 2.0112 1.8337 4.3235 4.8926 11.9756 4.4164 3.5379 5.7979 4.9103 3.8401 3.6400 5.7867 8.6150 4.6674 2.4816 3.3518 1.2161 3.4384 1.5960 3.1726 2.7632 5.2950 6.5989 6.2538 6.8564 4.7951 4.9241 2.9028 7.1513 1.7537 7.1505 5.7977 1.2694 1.8513 9.4519 2.4953 8.2557 1.3627 1.3692 4.8918 1.6983 1.4362 1.4040 2.2787 2.1718 1.7562 1.3828 2.1723 1.1150 1.9087 3.4182 1.2980 2.5723 3.4057 1.2489 5.3060 1.3308 3.8829 1.9030 1.0664 1.0790 1.4473 1.4192 2.9361 6.4184 7.3057 4.9011 1.2197 1.0375 1.0372 1.0973 1.0982 1.0987 1.0986 1.0892 1.0894 1.0957 1.0964 1.0757 1.0453 1.1040
irintensity: 3.5574 7.0375 0.9807 0.7196 0.2421 0.8467 1.7598 1.1001 0.6555 1.3154 7.4407 7.0038 6.9637 7.9564 9.6739 2.5274 16.3346 1.9558 14.9810 39.9554 6.0708 8.8336 0.0748 73.1529 396.9012 6.2563 25.6554 3.9801 19.7931 10.0444 0.8038 18.0373 19.2055 1.7770 16.7318 88.6964 50.9899 48.3840 1.7768 79.2724 4.8577 5.6467 52.3324 1.6501 0.2018 7.7098 6.1454 1.2226 7.9517 23.8639 70.0064 38.0077 25.4159 3.4931 57.9082 2.1233 1.3175 5.2707 86.7981 13.3215 14.2348 4.0473 7.8873 1.8751 11.9359 1.6930 38.2828 27.8249 49.8720 65.7226 9.8087 6.7684 226.0871 290.7577 30.2870 24.9672 13.9874 13.6505 14.2316 7.9794 13.9470 13.0203 5.0833 9.0615 19.8883 143.4522 26.0847
temp: 298.150 k
press: 1.00000 atm
elementType: 16 8 8 8 7 7 7 6 6 6 6 6 6 6 6 6 6 6 1 1 1 1 1 1 1 1 1 1 1 1 1
symmnumber: 1
zpe: 599178.9 jmol-1
zpe.correction: 0.228215 hartree
zpe.thermalcorrener: 0.247394 hartree
zpe.thermalcorrenthalpy: 0.248339 hartree
zpe.thermalcorrgfe: 0.177611 hartree
zpe.sumelectzpe: -1213.426484 hartree
zpe.sumelectthermal: -1213.407305 hartree
zpe.sumelectthermalent: -1213.406361 hartree
zpe.sumelectthermalfe: -1213.477089 hartree
dipole: 2.2014 -2.5318 -1.7070
dipole: 3.7643
quadrupole: -55.1575 -119.9999 -118.5660
quadrupole: -18.1072 -3.6818 -9.9462
quadrupole: 42.7503 -22.0921 -20.6582 -18.1072 -3.6818 -9.9462
hfenergy: -1213.6546995 hartree
pointgroup: C01 [X(C11H13N3O3S1)]
dipole: 0.8886274 -0.4822995 1.0821434 debye
polarizability: 323.9050956|4.925195|119.3012838|4.2538052|20.7253906|186.3229281 unknown
InChI: InChI=1S/C11H13N3O3S/c1-7-8(2)13-17-11(7)14-18(15,16)10-5-3-9(12)4-6-10/h3-6,14H,12H2,1-2H3
charge 0 multiplicity 1
31 atoms
S  0.45869 -0.207011 -1.799123
O  -1.263581 -1.023975 1.146272
O  0.866824 -0.770419 -3.276154
O  -0.373533 1.182888 -1.598022
N  -0.697734 -1.751593 -1.028658
N  -2.434532 -0.596412 1.907296
N  5.355543 -0.094691 1.729318
C  1.957495 -0.173076 -0.716273
C  -1.68263 -1.310189 -0.175717
C  -3.062755 -1.081719 -0.282105
C  -3.475123 -0.668102 1.033151
C  3.068439 -0.955758 -1.083797
C  1.933549 0.6261 0.442952
C  -3.919541 -1.21752 -1.507176
C  4.208849 -0.922338 -0.26581
C  3.075953 0.652389 1.257298
C  4.228952 -0.122271 0.919025
C  -4.854007 -0.290367 1.494617
H  -1.068642 -2.137437 -1.918138
H  3.041693 -1.556619 -1.998254
H  1.045849 1.214603 0.69378
H  -3.30716 -1.339758 -2.418489
H  -4.601476 -2.086785 -1.439367
H  -4.546546 -0.318895 -1.652233
H  5.089372 -1.515665 -0.537262
H  3.080382 1.267805 2.163915
H  -5.554665 -1.138821 1.390125
H  -4.830283 0.015355 2.553087
H  -5.254007 0.549171 0.896937
H  6.177814 -0.646372 1.501005
H  5.375413 0.464982 2.577301
