program: Gaussian 09
title: 000005495
version: EM64L-G09RevD.01
frameworkgroup: C1[X(C16H20N2O3S)]
method: RPBEPBE
basis: SDD
operation: Freq
keyword: #p
keyword: freq=noraman
keyword: PBEPBE/SDD
title: #p freq=noraman PBEPBE/SDD
converged: YES YES NO NO
title: Mulliken charges:
elementType: S O O O N N C C C C C C C C C C C C C C C C H H H H H H H H H H H H H H H H H H H H
charge: 0.238604 -0.275135 -0.249630 -0.260043 -0.190428 -0.395219 -0.163125 0.356930 -0.278141 -0.723837 -0.713870 0.116277 -0.232421 0.188684 -0.160675 -0.198721 -0.200167 -0.266759 -0.680369 -0.230779 -0.215745 -0.231714 0.213883 0.261459 0.213396 0.210747 0.226836 0.258826 0.207980 0.230634 0.242741 0.361471 0.208466 0.195448 0.307728 0.252778 0.210787 0.229159 0.233509 0.234211 0.233250 0.232976
chargesum: 0.00000
title: Mulliken charges with hydrogens summed into heavy atoms:
elementType: S O O O N N C C C C C C C C C C C C C C C C
charge: 0.238604 -0.275135 -0.249630 -0.260043 -0.190428 -0.033749 0.050759 0.356930 -0.278141 -0.038235 -0.020228 0.116277 0.240953 0.188684 -0.160675 0.205193 0.107561 -0.013981 -0.006914 0.003432 0.017505 0.001262
polarizability: 2.37892404e+02 1.06824119e+01 2.46693346e+02 1.28519476e+00 -2.40501966e+00 1.65851155e+02
1716.lowfreq: -6.0475 -0.0023 -0.0014 0.0016 5.4449 10.4234 14.3138 25.2985 37.2390
frequency: 14.0680 25.0661 37.1958 44.7059 57.5965 59.9016 68.9422 86.8143 104.6715 140.8985 168.1431 170.6146 187.6757 209.5148 213.8120 227.0603 236.5023 241.8659 250.7779 265.5141 293.6183 337.3275 358.8838 387.9056 401.9054 408.0049 412.0277 427.0746 435.4865 463.5987 479.7970 511.9351 557.4126 590.3751 609.3150 664.7856 670.0425 687.3204 695.7118 708.7042 745.6226 755.0028 790.9014 814.4407 819.5279 831.1499 853.7171 862.7842 900.5490 925.1418 929.5978 958.9022 973.4682 979.5560 985.8112 998.3772 1002.5682 1013.6818 1033.3890 1046.7232 1069.6984 1080.1445 1114.3701 1116.5472 1132.4459 1156.0909 1164.4180 1172.8664 1173.7575 1192.2839 1223.9587 1257.4315 1266.7852 1296.6452 1301.9337 1317.2500 1339.0479 1351.8002 1356.0660 1373.6983 1376.0764 1384.3870 1392.6109 1393.4022 1417.8658 1428.9682 1453.3278 1461.3353 1464.2539 1464.9703 1479.2802 1480.7069 1482.2917 1492.3888 1498.1651 1554.3299 1586.0937 1589.2552 1613.0852 1657.0398 2938.7204 2981.8031 2984.4881 2990.9181 2994.6759 3006.3003 3028.1229 3065.9908 3070.2876 3075.9067 3092.8563 3102.0388 3102.0660 3108.3861 3127.6062 3134.0255 3143.1880 3153.1573 3167.7098 3524.4315
redmass: 3.8163 4.6648 5.5275 4.1761 4.6000 1.9498 4.0927 3.0242 5.3277 5.4941 5.0102 6.1501 3.2540 4.0624 4.3766 3.0077 1.2498 1.1744 1.2208 2.9980 4.8463 6.1582 8.4490 9.6220 3.5373 2.6100 5.5784 3.2604 3.8872 4.1117 3.8306 4.5010 7.9843 5.5677 6.4644 4.4985 6.8119 4.2969 2.4253 3.9485 2.6281 1.4792 2.7088 2.9718 1.2289 5.3984 1.2509 3.2339 2.5270 1.1788 1.3577 1.4425 4.2467 2.5815 2.1548 2.0151 1.4381 3.6718 1.9312 3.6054 2.1314 1.6862 2.6448 2.1861 1.5772 2.1020 2.6895 1.0996 2.4484 1.1285 3.1837 1.1598 3.8177 1.5902 1.3657 1.3023 1.5170 1.7297 1.4571 1.1899 8.7485 2.4212 1.2281 1.3701 1.3072 2.1271 1.0918 1.0505 1.7346 1.1152 1.0491 1.0517 1.0519 1.0792 1.0631 8.7121 5.9940 6.0991 7.1445 6.5508 1.0554 1.0359 1.0361 1.1064 1.0362 1.0555 1.0829 1.1087 1.0999 1.0993 1.0992 1.1006 1.1008 1.0988 1.0861 1.0888 1.0932 1.0965 1.1016 1.0769
irintensity: 0.5885 0.5890 0.0689 0.6509 0.2329 1.9641 0.0395 0.1515 0.4473 5.4302 3.3131 5.2495 1.2694 0.8513 0.5194 1.6603 0.2036 1.3947 0.2646 1.3710 1.8422 10.2527 2.5680 7.7369 7.1420 3.6274 7.3276 6.2789 1.2169 1.1886 13.3714 13.9874 9.8407 2.1883 0.4921 0.3757 14.4500 15.1440 32.0545 7.5832 30.4150 63.2028 81.4139 5.5958 1.6050 7.2035 0.9822 29.6199 8.5333 5.3109 2.8599 0.0914 68.3611 42.5430 10.1198 47.5641 5.5368 17.4234 8.4492 224.3713 2.0111 7.6994 2.6834 9.9473 0.5058 11.4437 2.4915 2.8928 29.6974 2.2213 42.1587 0.5442 56.5777 55.9272 10.7268 1.4959 58.6691 105.9386 19.5855 20.1555 1.4976 139.5708 18.9726 89.8802 17.6456 13.3746 60.0060 13.3115 20.6398 8.7587 29.6357 5.4385 2.2549 7.4639 19.7617 47.2545 16.2825 4.6013 361.8255 601.7319 73.8895 41.0338 28.8814 39.3138 19.8266 36.9500 6.1294 6.4022 21.6363 48.9007 40.4008 10.9571 21.9766 21.3029 6.6127 14.1423 1.1001 17.8368 30.0787 65.5474
temp: 298.150 k
press: 1.00000 atm
elementType: 16 8 8 8 7 7 6 6 6 6 6 6 6 6 6 6 6 6 6 6 6 6 1 1 1 1 1 1 1 1 1 1 1 1 1 1 1 1 1 1 1 1
symmnumber: 1
zpe: 879573.7 jmol-1
zpe.correction: 0.335012 hartree
zpe.thermalcorrener: 0.357575 hartree
zpe.thermalcorrenthalpy: 0.358519 hartree
zpe.thermalcorrgfe: 0.280917 hartree
zpe.sumelectzpe: -1353.310326 hartree
zpe.sumelectthermal: -1353.287763 hartree
zpe.sumelectthermalent: -1353.286818 hartree
zpe.sumelectthermalfe: -1353.364421 hartree
dipole: -2.4778 3.8429 1.5925
dipole: 4.8419
quadrupole: -133.9704 -138.6474 -136.4875
quadrupole: 4.3787 3.5473 -7.1320
quadrupole: 2.3980 -2.2790 -0.1191 4.3787 3.5473 -7.1320
hfenergy: -1353.6453375 hartree
pointgroup: C01 [X(C16H20N2O3S1)]
dipole: -0.0989686 1.8030961 -0.6064952 debye
polarizability: 251.1883061|-7.398012|233.2348318|2.6312905|3.3299232|166.0137672 unknown
InChI: InChI=1S/C16H20N2O3S/c1-4-21-10-18-15(22-12-8-6-5-7-9-12)13(11(2)3)14(19)17-16(18)20/h5-9,11,17H,4,10H2,1-3H3
charge 0 multiplicity 1
42 atoms
S  -0.361391 0.562722 -1.926075
O  2.527552 1.300712 -0.043107
O  -0.674012 -3.705657 1.174008
O  3.527641 -1.91136 0.349086
N  1.662375 -0.825045 -0.617016
N  1.388991 -2.7645 0.708558
C  -2.107896 -1.757453 -0.517776
C  -0.600256 -1.735232 -0.277444
C  0.257256 -0.789011 -0.814216
C  -2.556351 -3.07252 -1.213158
C  -2.897589 -1.514175 0.797996
C  -0.025088 -2.794592 0.579447
C  2.560631 0.241533 -1.059434
C  2.282979 -1.844617 0.164127
C  -1.271424 1.644207 -0.717276
C  3.62094 2.278056 -0.231582
C  -0.644868 2.107743 0.460888
C  -2.588097 2.032338 -1.051846
C  3.496436 3.323329 0.875498
C  -1.368146 2.959569 1.327171
C  -3.291386 2.903612 -0.187108
C  -2.686763 3.361313 1.006162
H  -2.339355 -0.92618 -1.207203
H  -2.372704 -3.943894 -0.563633
H  -2.021351 -3.223689 -2.168931
H  -3.639045 -3.02323 -1.432738
H  -2.614456 -0.551438 1.260553
H  -2.710158 -2.325956 1.520164
H  -3.981123 -1.483361 0.579794
H  2.223503 0.634419 -2.034739
H  3.575831 -0.191069 -1.126131
H  1.80681 -3.504265 1.282057
H  4.594796 1.74623 -0.17486
H  3.534007 2.747605 -1.23544
H  0.389861 1.822097 0.680456
H  -3.0602 1.655489 -1.965421
H  4.304982 4.071366 0.787308
H  2.527443 3.84777 0.808415
H  3.569531 2.84462 1.867013
H  -0.89415 3.315964 2.248558
H  -4.311933 3.209668 -0.441773
H  -3.238225 4.025779 1.680348
