program: Gaussian 16
title: Title Card Required
version: ES64L-G16RevC.01
method: UPBE1PBE
basis: def2SVPP
operation: Freq
keyword: #N
keyword: Geom=AllCheck
keyword: Guess=TCheck
keyword: SCRF=Check
keyword: GenChk
keyword: UPBE1PBE/def2SVPP
keyword: Freq
converged: YES YES NO YES
elementType: H
elementType: C
elementType: N
elementType: O
elementType: Ru
1716.lowfreq: -1337.4636 -0.0013 -0.0009 0.0002 3.4355 9.6688 13.0004 26.3211 34.2170
frequency: -1337.4631 24.0836 33.4782 35.2270 38.3825 39.9888 54.8740 66.0794 72.1003 76.8779 79.9117 88.5581 97.9264 109.1887 113.8709 116.7516 125.5534 138.1102 144.2114 153.9898 160.3880 168.9541 186.8094 193.8897 203.2764 229.0151 233.9146 241.4890 256.1087 269.5501 273.6531 282.1251 300.2432 320.8176 327.2005 333.0734 348.9889 359.6382 380.9162 423.1830 426.2502 431.1761 445.1238 446.8903 494.5156 501.0684 508.7003 519.8253 538.9690 571.5699 602.0310 609.5942 618.0401 625.5365 635.8723 639.7499 657.9272 690.1619 694.0698 713.4483 728.4055 751.5950 765.3006 770.4207 799.3828 821.5567 837.6392 846.5959 888.3793 891.6843 916.0820 921.8152 922.7912 929.1250 934.7562 936.2628 959.4753 964.4908 976.7887 980.0298 996.3063 999.4595 1006.3947 1011.3423 1025.4467 1028.9352 1036.3592 1036.6296 1040.3891 1054.3258 1057.1986 1064.6862 1080.2664 1080.4897 1106.2695 1106.8507 1123.0998 1147.0150 1149.2931 1155.3557 1157.8681 1163.7255 1175.4768 1196.4356 1219.6565 1240.1163 1248.4724 1262.9810 1298.8392 1308.6576 1315.5259 1319.9440 1334.4975 1353.3077 1354.9638 1357.1297 1379.3643 1382.3610 1391.2924 1393.5270 1397.3494 1404.2419 1414.6063 1423.3792 1424.9526 1439.3109 1449.6674 1451.7708 1457.6944 1459.6688 1466.3551 1470.9381 1481.3223 1485.6386 1493.5523 1509.5375 1522.6344 1531.8328 1549.5906 1574.8599 1607.7507 1622.3600 1657.2961 1673.6554 1682.3308 1688.1810 1693.4560 1749.9461 3033.3950 3041.0534 3043.4172 3049.5264 3053.6217 3128.4629 3129.7937 3132.3012 3134.0515 3145.4604 3149.8741 3166.6324 3178.3932 3191.7943 3197.9529 3205.8307 3208.0707 3216.8639 3218.0898 3219.5923 3227.8808 3228.8993 3235.7982 3239.4908 3239.7154 3255.4255
redmass: 1.1004 4.5778 4.1607 4.8383 3.4202 4.7395 4.8652 4.1075 1.5092 5.0683 2.4644 4.0435 1.0659 5.3585 9.7386 4.8401 5.2210 6.2252 5.4089 8.2113 7.2975 6.9262 4.3259 4.8282 5.8874 2.7326 2.8896 4.8521 3.9525 3.8418 2.1653 5.6719 1.1313 15.4863 4.8902 3.0499 2.9768 5.9056 3.1573 4.3821 3.7997 3.6278 3.0389 3.3233 4.1574 5.8110 4.2787 3.0614 4.5551 4.4448 3.5149 2.5854 6.5835 6.1413 5.0135 5.0307 5.7290 4.2205 5.3524 3.0245 3.6485 6.0014 5.9566 1.5652 1.6291 2.9969 4.2304 3.5446 1.2293 4.2280 1.4170 2.0340 1.5799 1.2839 1.3737 1.1858 5.0615 5.7208 1.3288 1.3947 1.2694 1.4186 1.4342 1.3731 6.5141 1.4992 2.2734 1.3494 1.3360 1.5997 1.9285 2.2688 1.7636 1.8710 1.5003 2.0858 1.4847 1.6517 1.9200 1.0885 1.1042 1.9533 1.2053 1.2530 2.1078 2.0329 1.9405 2.1303 1.9801 1.4002 1.6609 1.4509 3.6491 1.8699 1.7652 1.3158 3.9441 1.9042 3.2428 1.6969 1.3026 1.6299 1.5696 1.0661 6.5502 1.1836 1.0838 1.2568 1.0486 1.5044 1.1060 1.0407 1.0934 2.8320 2.7505 3.4623 2.6148 3.3109 3.1478 5.0914 5.8932 5.8138 6.1634 7.5229 6.5807 7.5080 6.6887 11.9086 1.0372 1.0420 1.0396 1.0398 1.0844 1.1058 1.0989 1.1043 1.1055 1.1004 1.1039 1.1074 1.1092 1.0911 1.0923 1.0912 1.0939 1.0941 1.0904 1.0915 1.0959 1.0977 1.0987 1.0932 1.0933 1.0971
irintensity: 8669.2611 0.8472 0.8175 1.0216 1.9947 2.2448 2.9814 13.4309 4.6675 5.7592 1.8803 9.6868 1.3267 2.4696 3.8189 5.7804 16.4765 8.5439 1.8230 4.5557 1.1983 5.9436 4.0507 3.8726 17.4021 3.3885 9.9752 2.2905 12.4627 1.6267 6.5260 8.9717 0.9942 52.5795 53.5317 1.7027 4.4401 32.3004 1.9150 13.5104 1.9178 2.9622 1.0456 3.7286 15.8525 4.9120 12.2666 3.0314 7.4254 6.3699 5.1971 8.8431 1.7745 10.6275 2.7378 31.7583 9.2773 9.6484 74.9837 6.4551 40.6846 15.1171 37.1987 36.4867 44.0921 56.4272 14.6375 8.5856 27.6585 15.2417 9.1702 17.2008 0.9870 10.4197 21.1933 1.2547 5.4212 94.9293 16.1084 0.4001 0.8349 0.7480 2.1859 2.0415 17.3300 16.6508 3.0463 0.0329 0.8710 33.7240 20.9689 38.3480 7.5128 25.8482 14.5578 11.7124 6.5025 90.6276 2.8766 2.8315 19.9084 1.2925 17.9246 664.8278 266.8372 3.5558 1.0674 12.0070 8.0369 3.2902 35.5662 0.3442 240.4642 158.8055 26.6243 7.5831 8.5872 4.8101 23.6744 10.0832 1.3422 1.8209 6.5450 60.6043 198.4580 41.1869 25.7996 43.9549 2.4330 72.1170 3.6903 20.6369 4.3557 224.4399 11.2964 236.3351 116.9542 74.2584 67.9311 17.8062 16.2530 162.9001 184.1400 46.9402 55.8546 644.0657 668.0374 1419.0151 32.3123 10.7873 18.4003 2.3337 15.9900 11.8582 6.1442 40.1232 28.7146 5.3919 10.4115 4.6879 6.6233 9.0300 18.4428 4.6133 7.1157 9.4476 1.5946 4.0529 1.3009 13.9228 5.0366 1.5005 6.0285 0.7970
temp: 298.150 k
press: 1.00000 atm
elementType: 1 6 6 7 6 6 6 6 6 6 6 8 1 1 1 1 6 6 7 6 6 6 1 1 1 1 1 6 6 6 6 1 6 1 6 1 1 6 1 1 1 6 1 6 6 1 1 1 1 1 1 44 8 6 8 6 1 1 1 17
symmnumber: 1
zpe: 1245498.1 jmol-1
zpe.correction: 0.474385 hartree
zpe.thermalcorrener: 0.506905 hartree
zpe.thermalcorrenthalpy: 0.507849 hartree
zpe.thermalcorrgfe: 0.408123 hartree
zpe.sumelectzpe: -1894.137342 hartree
zpe.sumelectthermal: -1894.104822 hartree
zpe.sumelectthermalent: -1894.103878 hartree
zpe.sumelectthermalfe: -1894.203604 hartree
dipole: 1.6166 -2.2078 -10.0588
dipole: 10.4244
quadrupole: -182.1386 -201.6171 -226.0356
quadrupole: -19.2007 14.4759 13.7676
quadrupole: 21.1252 1.6467 -22.7719 -19.2007 14.4759 13.7676
hfenergy: -1894.6117275 hartree
pointgroup: C01 [X(C26H27Cl1N2O3Ru1)]
dipole: 0.6360238 -0.8686248 -3.9574476 debye
polarizability: 581.521674|6.4479006|573.7245286|-51.7925021|22.7156666|424.2463384 unknown
InChI: InChI=1S/C16H13N2O3.C10H14.ClH.Ru/c1-11(19)21-22-14-10-18(15-8-4-5-9-17-15)16(20)13-7-3-2-6-12(13)14;1-8(2)10-6-4-9(3)5-7-10;;/h2-10H,1H3;4-8H,1-3H3;1H;/q;;;+1/p-1
charge 0 multiplicity 3
60 atoms
H  0.09885394 -0.40921638 2.20417258
C  0.29001506 0.38791348 1.11306015
C  1.48257081 -0.01040256 0.56945282
N  2.41319502 0.836367 0.02596749
C  2.20353486 2.21785571 -0.06195298
C  0.9634054 2.70435823 0.54696114
C  0.03058187 1.8155052 1.13276245
C  -1.14954211 2.35752466 1.68410742
C  -1.38791732 3.7223711 1.64610975
C  -0.46000366 4.59491552 1.05380073
C  0.70690421 4.08622221 0.50890008
O  3.01608374 2.94013477 -0.6256319
H  1.44435337 4.74521678 0.04332726
H  -0.65831824 5.67031646 1.02330181
H  -2.31034016 4.1230971 2.07822149
H  -1.87760211 1.67485154 2.13367198
C  3.57296216 0.25427378 -0.57519811
C  4.84656384 0.77102948 -0.33433034
N  3.3417498 -0.8094673 -1.33143098
C  5.92469406 0.13336115 -0.94004088
C  4.38138119 -1.4212681 -1.89720727
C  5.6939977 -0.98448308 -1.74095488
H  4.98796909 1.63651364 0.31369317
H  6.94100706 0.50407764 -0.77691757
H  4.15356643 -2.30084651 -2.51058844
H  6.51529527 -1.51323632 -2.23182004
H  1.77235129 -1.06327734 0.54657682
C  -1.22439011 -2.60532625 -1.25949196
C  -0.9269253 -0.18210569 -1.72435753
C  -0.38902645 -1.49430506 -1.50982131
C  -2.31153015 0.06333035 -1.6614084
H  0.68846927 -1.63632308 -1.63533181
C  -3.08882276 -0.9825061 -1.10297827
H  -4.14450364 -0.80783111 -0.87734163
C  -2.56030878 -2.29931757 -0.92075461
H  -3.22699675 -3.08887276 -0.56308193
H  -0.23245574 0.61733238 -1.99052699
C  -0.68686085 -3.99436491 -1.18860339
H  0.3837803 -3.99398567 -0.92834314
H  -1.23791026 -4.59912873 -0.45074415
H  -0.79406211 -4.48500336 -2.17445063
C  -2.9474197 1.38810167 -2.00033332
H  -3.67154559 1.60189946 -1.19327466
C  -3.73504803 1.23970158 -3.30618176
C  -1.96191667 2.54560232 -2.07897796
H  -1.37575443 2.64654723 -1.15002427
H  -1.2583577 2.42450967 -2.92172806
H  -2.50952362 3.49056189 -2.23733308
H  -3.05740279 1.00623872 -4.14721991
H  -4.26214988 2.18127067 -3.54101975
H  -4.48741126 0.43466445 -3.23804937
Ru -1.43108878 -0.80290112 0.41701558
O  0.22104447 -1.14457938 3.24317178
C  -0.03851454 -2.35316635 2.91969654
O  -0.36940803 -2.70848608 1.7742633
C  0.03362703 -3.36872466 4.02955319
H  0.81844147 -3.10732031 4.75700349
H  0.20227447 -4.37878583 3.62524906
H  -0.93733594 -3.36282683 4.55879525
Cl -2.91354372 -0.7552364 2.29702795
