program: Gaussian 09
title: 000040712
version: EM64L-G09RevD.01
frameworkgroup: C1[X(C15H14BrN3O3S)]
method: RPBEPBE
basis: SDD
operation: Freq
keyword: #p
keyword: freq=noraman
keyword: PBEPBE/SDD
title: #p freq=noraman PBEPBE/SDD
converged: YES YES NO NO
title: Mulliken charges:
elementType: Br S O O O N N N C C C C C C C C C C C C C C C H H H H H H H H H H H H H H
charge: 0.056865 0.953923 -0.201064 -0.531091 -0.532689 -0.205301 -0.294650 -0.716635 -0.316239 -0.468963 0.121351 0.605971 0.430878 -0.401082 -0.285463 -0.058527 -0.357598 -0.356366 -0.196706 -0.233890 -0.228946 -0.230413 -0.262002 0.250447 0.244030 0.254360 0.259805 0.279452 0.239434 0.230754 0.304809 0.287852 0.223228 0.223194 0.228922 0.341338 0.341012
chargesum: 0.00000
title: Mulliken charges with hydrogens summed into heavy atoms:
elementType: Br S O O O N N N C C C C C C C C C C C C C C C
charge: 0.056865 0.953923 -0.201064 -0.531091 -0.532689 -0.205301 -0.294650 -0.034285 0.178237 0.045202 0.121351 0.605971 0.430878 -0.401082 -0.006012 -0.058527 -0.118164 -0.125612 0.108103 0.053962 -0.005718 -0.007219 -0.033080
chargesum: -0.00003
polarizability: 3.53356224e+02 1.48505350e+01 2.15578187e+02 -5.15828841e+00 1.49172716e+01 1.58496984e+02
1716.lowfreq: -7.9802 -0.0611 -0.0462 0.0013 1.3181 4.4708 13.0822 18.3909 30.6075
frequency: 12.6781 18.3030 30.6039 33.4660 63.2097 74.0426 89.3568 94.2815 96.5064 129.6558 136.6750 161.2828 167.1280 175.1451 203.0782 209.4614 224.4354 251.8992 270.3997 297.7820 309.3534 330.7406 377.5071 383.8438 412.9106 419.9868 449.5759 460.2339 469.2491 493.4579 503.5584 557.0782 593.2347 594.5520 613.5224 634.3047 640.4315 691.6502 694.6697 733.0701 753.8396 754.5017 790.1134 806.5566 809.8446 835.7771 836.9755 868.3238 902.0965 910.2021 931.9844 956.2431 967.8234 974.1559 978.0997 993.6529 1013.0776 1023.6955 1033.2626 1065.7967 1074.9143 1081.7798 1089.8721 1117.2596 1143.3766 1162.4550 1173.4374 1179.2238 1197.3584 1199.7409 1230.6019 1255.9450 1306.9594 1310.1119 1339.4140 1362.3421 1373.9130 1382.5823 1387.1448 1401.2707 1452.4861 1462.5657 1481.1577 1505.4362 1521.3337 1532.5481 1576.4408 1580.8007 1582.1352 1626.3878 1661.8777 2916.8209 2949.7943 2988.2841 2991.9226 3124.9519 3129.9565 3145.9868 3152.1394 3164.3049 3164.8083 3169.3393 3183.1793 3374.4615 3542.9316
redmass: 6.6116 9.1453 5.6194 5.5315 6.7695 5.8080 5.4156 7.3622 1.8089 3.4831 2.8080 8.8684 5.2567 3.8324 5.9178 7.2785 5.1386 5.6661 2.7594 8.7037 7.9482 7.8383 7.2848 5.5693 2.9161 8.6914 3.6155 3.9058 4.5693 5.2659 2.7148 4.8482 3.9523 3.7499 6.3803 7.0228 7.1029 1.8377 6.4860 4.0952 1.8411 4.0325 1.9595 8.8857 1.2646 2.6909 2.0505 1.4910 1.4954 3.5620 5.7059 1.3619 1.4151 4.8782 1.3021 4.6777 1.7638 6.0369 2.0020 2.0096 1.7225 1.4660 1.6522 4.2136 1.3676 1.1013 1.0542 1.0508 2.2165 1.4975 2.6935 1.7820 1.9302 1.8003 1.4291 4.8213 4.7352 4.0828 3.2608 2.0741 2.4979 2.7814 1.1310 2.5818 1.1669 1.0852 8.8328 6.5914 6.2962 6.0775 11.8456 1.0664 1.0575 1.0981 1.1014 1.0844 1.0873 1.0922 1.0952 1.0896 1.0926 1.1011 1.0973 1.0414 1.1008
irintensity: 0.1921 0.2955 1.2179 0.7899 0.2910 1.8610 1.7694 6.2969 25.5380 8.6044 11.3112 0.7098 4.7296 0.6104 7.3839 3.0218 0.2362 0.8253 2.9241 0.6408 23.0586 9.4809 21.1046 10.3560 0.0170 50.9044 2.7021 115.8683 40.4251 32.3844 14.7199 22.2010 6.0938 13.5357 1.1723 7.5143 12.7625 39.8123 21.2259 7.7594 86.3703 25.7047 88.3799 167.1640 1.1319 10.8377 14.2525 5.9151 16.8205 48.2382 2.8688 0.0563 1.9095 0.6846 0.2450 11.5166 1.0253 38.3214 20.8686 29.1173 20.1893 5.3984 10.0745 59.3189 1.5724 5.6886 0.7035 9.6270 10.9807 10.4876 62.5971 53.9356 125.3165 117.5810 6.4630 22.4753 44.4681 16.9996 116.2724 111.0752 7.8221 221.5835 23.2649 188.1089 3.5373 23.9839 10.1718 12.1268 24.1391 232.0563 292.7372 55.8967 51.1687 2.6009 28.5577 15.6958 2.0128 31.2287 34.4155 2.1764 9.3610 13.8048 4.6893 38.0612 29.5229
temp: 298.150 k
press: 1.00000 atm
elementType: 35 16 8 8 8 7 7 7 6 6 6 6 6 6 6 6 6 6 6 6 6 6 6 1 1 1 1 1 1 1 1 1 1 1 1 1 1
symmnumber: 1
zpe: 700174.9 jmol-1
zpe.correction: 0.266683 hartree
zpe.thermalcorrener: 0.289086 hartree
zpe.thermalcorrenthalpy: 0.290030 hartree
zpe.thermalcorrgfe: 0.211067 hartree
zpe.sumelectzpe: -1379.605702 hartree
zpe.sumelectthermal: -1379.583299 hartree
zpe.sumelectthermalent: -1379.582355 hartree
zpe.sumelectthermalfe: -1379.661317 hartree
dipole: 1.7642 -0.2675 -0.9190
dipole: 2.0071
quadrupole: -145.4382 -153.7182 -162.2935
quadrupole: 3.5603 18.2478 -3.1885
quadrupole: 8.3784 0.0984 -8.4768 3.5603 18.2478 -3.1885
hfenergy: -1379.8723844 hartree
pointgroup: C01 [X(C15H14Br1N3O3S1)]
dipole: -0.6884556 0.3749404 -0.0948495 debye
polarizability: 352.9938876|0.3875716|185.0991222|17.8344713|31.9638971|189.3383854 unknown
InChI: InChI=1S/C15H14BrN3O3S/c16-13-8-12(23(17,21)22)6-7-14(13)19-10-18(9-15(19)20)11-4-2-1-3-5-11/h1-8H,9-10,17H2
charge 0 multiplicity 1
37 atoms
Br 0.784039 -0.233977 -2.738518
S  5.585572 -0.729408 0.257223
O  -0.205738 2.821456 1.065753
O  5.96612 -1.089381 1.798025
O  5.858484 -1.721644 -1.004545
N  -2.656625 0.360672 0.196392
N  -0.368523 0.621136 0.18652
N  6.41257 0.859807 -0.12945
C  -1.422392 -0.387801 -0.072263
C  -2.407372 1.725907 0.653139
C  -0.880288 1.836106 0.680677
C  1.025072 0.313547 0.158806
C  -3.926341 -0.201151 0.037866
C  1.698311 -0.12924 -1.013879
C  1.775623 0.472753 1.354878
C  3.754469 -0.280457 0.22244
C  -5.09807 0.568427 0.305166
C  -4.080696 -1.554795 -0.389132
C  3.07082 -0.45045 -0.988463
C  3.151739 0.182987 1.400777
C  -6.376016 -0.003673 0.147538
C  -5.36715 -2.109927 -0.541861
C  -6.526367 -1.344816 -0.276265
H  -1.383427 -0.757713 -1.115515
H  -1.296102 -1.255607 0.613346
H  -2.809202 1.927549 1.667888
H  -2.821389 2.497078 -0.029124
H  1.259793 0.834002 2.248335
H  -5.011301 1.60927 0.633513
H  -3.203446 -2.175748 -0.601103
H  3.590648 -0.82423 -1.875627
H  3.728106 0.280502 2.325246
H  -7.262106 0.606112 0.358366
H  -5.46207 -3.151102 -0.87098
H  -7.522307 -1.78278 -0.396288
H  7.009253 1.123339 0.671496
H  6.929807 0.75595 -1.017578
