program: Gaussian 16
title: Title Card Required
version: ES64L-G16RevC.01
method: UPBE1PBE
basis: def2SVPP
operation: Freq
keyword: #N
keyword: Geom=AllCheck
keyword: Guess=TCheck
keyword: SCRF=Check
keyword: GenChk
keyword: UPBE1PBE/def2SVPP
keyword: Freq
converged: YES YES NO YES
elementType: H
elementType: C
elementType: N
elementType: O
elementType: Ru
elementType: Cl
elementType: Cu
elementType: F
1716.lowfreq: -359.6525 -12.2270 -3.3565 -0.0011 0.0026 0.0038 15.3117 19.8072 25.9869
frequency: -359.6391 17.5549 25.2476 28.7419 31.4040 36.5498 43.7875 46.7264 49.9829 53.1743 58.5914 60.1393 64.1013 66.3895 72.5572 74.7570 82.8332 84.7985 92.9361 97.5398 99.9901 105.9071 113.5151 115.9491 119.9851 124.2951 126.8241 128.8752 138.1537 143.3011 146.5197 153.4810 158.0980 165.1011 168.2549 172.8558 183.6015 190.5191 197.0771 205.5447 210.2786 220.8905 226.2693 235.2713 240.9083 243.2851 257.5551 268.6771 274.3520 277.9345 280.1845 286.7887 297.7046 304.7340 327.5348 342.7064 353.3401 354.5342 360.2123 384.0720 415.5461 422.6732 425.3336 437.0905 454.2353 460.4715 471.1255 503.4683 504.8238 509.3521 517.2265 520.0656 532.7855 541.6784 551.1299 561.7020 575.4852 581.4074 594.0025 616.7123 619.3540 623.9533 629.3959 642.1179 643.8180 668.1829 679.0624 684.5038 694.7583 706.7012 711.1889 715.3171 733.5559 738.9238 760.7540 777.4783 779.2677 792.5739 798.9378 803.8940 831.6078 842.2594 860.7781 865.6045 875.8867 891.6978 903.3821 918.9273 924.0369 938.5073 973.0319 975.6204 991.3915 998.3067 1001.9506 1002.9929 1008.4896 1011.4922 1015.3467 1033.7964 1035.1047 1035.8601 1037.5251 1040.6005 1043.4487 1058.5591 1060.5344 1061.0116 1062.0580 1066.4146 1080.2507 1082.0633 1105.5066 1106.1681 1113.0294 1128.8361 1130.0444 1133.1161 1150.3373 1154.4359 1162.0761 1178.0086 1185.4550 1203.3640 1211.8552 1243.9949 1252.8507 1261.2753 1273.2642 1279.6523 1310.3170 1322.2379 1341.0348 1357.9684 1358.5193 1361.9497 1362.2988 1372.2368 1375.8178 1394.1982 1403.6170 1410.5798 1413.9261 1418.3772 1425.3589 1426.1811 1428.8208 1438.2121 1443.1058 1446.2557 1454.4418 1456.3748 1473.2803 1473.7801 1491.3570 1492.7351 1519.7458 1524.6823 1534.4886 1537.7924 1561.1436 1564.0592 1608.0067 1652.8918 1658.7014 1664.4049 1666.1240 1686.1597 1692.1199 1706.2204 1772.5494 1778.5981 2876.2952 3045.9273 3050.9355 3052.2081 3056.0930 3143.9939 3145.5926 3151.4704 3152.3425 3164.4948 3175.4883 3177.4230 3181.4101 3188.7523 3210.1772 3214.3785 3217.8843 3219.1431 3226.5149 3227.0844 3233.1664 3234.2532 3240.5388 3243.2268 3246.7562 3270.1524 3277.9336
redmass: 5.0618 14.1313 9.2109 7.1592 7.7486 6.0350 4.6958 6.1602 5.4208 7.7433 6.9433 4.7454 2.0894 1.9102 9.3202 2.4962 6.6073 3.2696 4.6932 9.0872 4.2803 5.6754 7.2425 8.1314 5.7810 4.5916 10.1849 5.6074 8.9333 6.4025 6.6974 8.0246 11.4345 7.0211 6.0199 5.9115 6.0467 3.8636 8.9109 5.0060 4.9052 2.1178 6.9530 5.1212 11.3622 7.5214 12.4191 9.5344 6.3730 10.0362 10.3189 5.9020 9.4583 8.1442 6.3246 10.9761 6.4125 6.2103 4.9832 5.1522 6.1298 4.0448 3.3392 3.5683 4.9519 4.4461 3.9276 5.7381 3.5538 6.9688 3.7298 7.1472 5.1212 4.2115 3.6564 3.3275 3.5157 6.6126 10.9445 3.1422 2.5845 2.6336 2.4999 5.7952 7.1890 6.3443 3.6883 6.2720 6.9377 5.2178 6.1526 3.7695 4.3978 2.2152 4.3950 1.7760 2.3972 1.9739 2.2519 4.3113 3.1160 2.5629 1.3213 1.6754 2.2695 2.5067 1.4024 2.1356 1.9863 2.2787 5.6575 5.2119 5.7675 1.3956 1.4706 1.3688 1.4568 2.9352 1.5799 2.7576 1.3463 1.4781 1.5368 1.4701 1.3778 6.2808 1.9046 1.9084 1.9175 2.1688 1.8928 1.8425 2.3195 3.9490 1.8801 1.4403 1.3533 1.3868 1.2718 1.1670 1.0745 9.1724 1.1565 1.3688 4.2112 1.9130 2.0543 1.5223 1.7397 1.7456 1.5930 1.3199 2.8010 1.5733 1.6967 1.3101 4.0565 1.2961 6.1802 5.2674 2.1144 1.1654 8.8134 6.3470 1.0816 1.0627 1.0861 1.0983 1.1690 1.0564 1.1364 3.5598 6.1446 3.1375 5.0679 2.7897 5.8929 3.2770 3.3239 4.0460 7.9057 3.0053 8.8730 9.8292 7.0731 7.5864 7.3631 6.9394 7.1666 6.8547 12.5922 11.7244 1.0703 1.0723 1.0395 1.0388 1.0418 1.1029 1.1009 1.0896 1.0982 1.0919 1.1091 1.1078 1.0876 1.1088 1.0878 1.0918 1.0918 1.0918 1.0916 1.0963 1.0902 1.0988 1.0946 1.0964 1.0961 1.0961 1.0963
irintensity: 125.9630 0.1791 2.4523 0.3022 0.4009 3.7931 1.8231 2.0142 3.4522 1.9865 0.9692 2.2520 1.6636 5.2103 2.0223 1.1309 1.7483 1.5785 2.8984 9.0463 8.8082 0.7893 8.7396 11.7859 18.6984 2.7678 25.5921 1.3338 2.9013 22.9788 9.3856 6.8576 13.9170 20.7546 1.1467 38.0400 80.7913 2.5907 29.2390 5.2531 5.0546 3.3982 5.9471 6.9550 3.0120 17.5413 112.8670 15.2780 30.6206 46.7245 11.3639 1.7687 73.5231 37.9234 31.6892 86.0003 22.1508 45.5797 1.9393 6.7146 4.3113 4.2811 3.2400 11.0451 3.2618 1.0649 9.4481 1.0541 34.0219 4.6748 13.4919 33.4776 11.2728 10.2998 46.8242 8.7263 9.7799 13.9003 0.9995 39.1130 15.4936 23.0769 20.5330 13.9425 0.6572 2.0577 21.0202 82.4514 79.4793 8.6389 86.1484 28.6520 1.3302 24.5319 23.6534 26.0400 21.0834 15.9309 111.5883 22.1695 6.4776 78.1759 2.5550 25.8558 78.5722 11.6440 11.7230 51.0218 32.4123 1.5136 7.7183 8.8025 10.5543 25.4672 6.5347 2.8626 5.9880 49.7648 10.6531 19.9209 0.0195 1.0211 6.5180 9.1951 0.6847 8.5503 17.1181 30.7872 43.1965 17.4303 4.7936 81.6087 18.3431 137.1215 1.6221 4.3174 33.0279 11.1301 67.8118 2.5522 3.0265 405.4553 24.0079 64.6029 299.0733 18.0979 13.8394 168.8134 36.9121 172.5511 101.3041 6.2306 34.8188 56.6858 24.7443 4.1404 658.5539 3.9628 5.9820 920.6939 24.1665 89.5567 21.3249 45.2760 109.6512 5.5627 52.7447 30.2728 68.8317 16.7413 49.0447 89.5167 419.8572 61.4657 352.0745 10.1636 398.6808 377.7793 17.8703 27.3586 234.7419 74.2805 306.4319 160.4174 30.1928 15.3220 4.1208 71.7061 58.0636 6.5551 801.5442 467.3660 70.1349 7.0293 4.9808 3.3237 0.4310 2.2882 6.6696 8.9935 2.8117 1.7275 4.5771 8.5669 7.2508 5.2623 0.5409 6.3324 0.6772 2.2122 1.7967 3.0219 0.3826 9.4074 1.8652 0.0205 0.3594 6.4470 4.7642
temp: 298.150 k
press: 1.00000 atm
elementType: 1 6 6 7 6 6 6 6 6 6 6 8 1 1 1 1 6 6 7 6 6 6 1 1 1 1 1 44 17 17 8 8 8 8 8 8 6 6 6 6 1 1 1 6 1 1 1 6 1 1 1 29 29 6 6 6 1 1 1 1 8 6 6 6 6 6 6 1 1 1 1 6 9 9 9
symmnumber: 1
zpe: 1407999.1 jmol-1
zpe.correction: 0.536279 hartree
zpe.thermalcorrener: 0.584977 hartree
zpe.thermalcorrenthalpy: 0.585921 hartree
zpe.thermalcorrgfe: 0.449667 hartree
zpe.sumelectzpe: -6461.010012 hartree
zpe.sumelectthermal: -6460.961314 hartree
zpe.sumelectthermalent: -6460.960370 hartree
zpe.sumelectthermalfe: -6461.096624 hartree
dipole: -11.4368 8.8060 5.3796
dipole: 15.4041
quadrupole: -320.0709 -277.6636 -324.9160
quadrupole: 2.9984 -2.0808 -26.7704
quadrupole: -12.5207 29.8866 -17.3658 2.9984 -2.0808 -26.7704
hfenergy: -6461.5462908 hartree
pointgroup: C01 [X(C30H27Cl2Cu2F3N2O8Ru1)]
dipole: -4.8613059 2.9433248 2.1055567 debye
polarizability: 885.1070402|18.9277545|715.7811768|77.2289876|-46.9325938|549.7929654 unknown
InChI: InChI=1S/C14H10N2O.C10H8F3O.3C2H3O2.ClH.Cl.2Cu.Ru/c17-14-12-6-2-1-5-11(12)8-10-16(14)13-7-3-4-9-15-13;1-2-9(14)7-3-5-8(6-4-7)10(11,12)13;3*1-2(3)4;;;;;/h1-10H;3-6H,1-2H2;3*1H3;1H;;;;/q-1;;2*-2;-1;;;+1;2*+3/p-1
charge 0 multiplicity 3
75 atoms
H  -1.86289015 1.80424446 -1.67878945
C  -2.69844138 1.44261834 -1.07311366
C  -3.12378157 0.11085527 -1.32493561
N  -4.33805154 -0.28306919 -0.65284441
C  -5.33903426 0.6083069 -0.29478501
C  -5.01907299 2.04427303 -0.47303151
C  -3.70281534 2.45907602 -0.742817
C  -3.40716678 3.82449284 -0.80485391
C  -4.41319898 4.76434568 -0.59679649
C  -5.72104395 4.35015123 -0.328019
C  -6.02298277 2.99292075 -0.26417905
O  -6.38524569 0.23246349 0.2071658
H  -7.03931788 2.65335731 -0.04948207
H  -6.5088551 5.09207899 -0.16891407
H  -4.17803394 5.83135478 -0.65203315
H  -2.38682789 4.14442747 -1.03357315
C  -4.22444404 -1.51170791 0.00298795
C  -5.26732708 -2.40091636 0.24487416
N  -2.96542519 -1.76140753 0.41900943
C  -4.98655376 -3.5687679 0.94814687
C  -2.69199453 -2.90339364 1.06152048
C  -3.68155999 -3.82788208 1.36296426
H  -6.26645589 -2.17940987 -0.12575688
H  -5.78790322 -4.28452379 1.15270569
H  -1.64586765 -3.06588747 1.3255208
H  -3.4207318 -4.7414848 1.90174524
H  -2.9989296 -0.3096789 -2.33218483
Ru -1.48040503 -0.4931848 -0.24307934
Cl 0.38196984 0.70181448 -1.31123178
Cl -0.96007075 -2.23422803 -1.85773454
O  0.24945105 -1.3692171 0.88081145
O  2.16184383 -3.27988131 -0.72222045
O  3.14301757 -0.78489681 -2.33791891
O  1.98983693 -1.34799106 2.23615723
O  3.99403171 -2.65417829 0.39657843
O  4.07140818 0.22040662 -0.57349713
C  3.28216563 -3.50743935 -0.19063715
C  3.94008318 0.02161435 -1.82488987
C  0.74742097 -1.45324809 2.03458584
C  4.83584052 0.86050156 -2.70232908
H  4.70717084 0.6050861 -3.76469689
H  4.59642851 1.92810677 -2.54980064
H  5.88935284 0.71760549 -2.40767416
C  -0.12123764 -1.75959549 3.22068478
H  0.32199048 -1.35332484 4.14198458
H  -1.14120847 -1.36926737 3.08676397
H  -0.18260156 -2.85858185 3.32515851
C  3.82067215 -4.91384353 -0.3022157
H  4.37875316 -4.99743353 -1.25308761
H  4.51311675 -5.1408367 0.52327019
H  3.00005435 -5.64812662 -0.32637765
Cu 3.09826264 -0.79667813 0.73056728
Cu 1.41813137 -1.45959352 -1.14108327
C  -0.90779944 2.40008157 1.08987391
C  0.31852354 1.96700874 1.86322963
C  -1.92134126 1.27728442 0.96437773
H  -1.34424536 3.22526272 1.68616847
H  -0.64602718 2.8310423 0.1152405
H  -1.63940394 0.42468988 1.64580357
H  -2.93092525 1.54661745 1.29268739
O  0.18097588 1.23289474 2.8272388
C  1.68424019 2.43822195 1.49040777
C  1.94071754 3.26756675 0.39360344
C  2.76016583 1.98594409 2.27231095
C  3.24740656 3.62411213 0.07006712
C  4.06417437 2.33910129 1.95516629
C  4.3054406 3.15383057 0.84473489
H  1.12762527 3.63975603 -0.23151307
H  2.55646943 1.34308218 3.13126891
H  3.43771989 4.26314152 -0.79494944
H  4.89501148 1.97024404 2.56320563
C  5.72626554 3.47101082 0.47560534
F  6.41004191 3.95917132 1.51807899
F  5.81172584 4.36673948 -0.51025378
F  6.38262773 2.37469724 0.06743921
