program: Gaussian 09
title: 000005421
version: EM64L-G09RevD.01
frameworkgroup: C1[X(C24H24N3O3)]
method: RPBEPBE
basis: SDD
operation: Freq
keyword: #p
keyword: freq=noraman
keyword: PBEPBE/SDD
title: #p freq=noraman PBEPBE/SDD
converged: YES YES NO NO
title: Mulliken charges:
elementType: O O O N N N C C C C C C C C C C C C C C C C C C C C C C C C H H H H H H H H H H H H H H H H H H H H H H H H
charge: -0.259056 -0.431590 -0.241301 -0.142391 -0.142186 -0.691587 0.283044 0.227387 0.214961 0.195660 0.192271 0.183860 -0.370678 -0.359917 -0.528571 -0.526812 0.433379 0.434025 0.138652 -0.380315 -0.382628 -0.364030 -0.545007 -0.429965 0.537973 -0.639326 -0.636304 0.075753 -0.636107 -0.639366 0.263886 0.266223 0.285882 0.286148 0.257380 0.257487 0.259847 0.284932 0.241293 0.253329 0.251660 0.239468 0.238796 0.252182 0.251003 0.238906 0.252549 0.251264 0.252083 0.239616 0.253363 0.325457 0.328382 0.399034
chargesum: 1.00000
title: Mulliken charges with hydrogens summed into heavy atoms:
elementType: O O O N N N C C C C C C C C C C C C C C C C C C C C C C C C
charge: -0.259056 -0.032556 -0.241301 -0.142391 -0.142186 -0.037747 0.283044 0.227387 0.214961 0.195660 0.192271 0.183860 -0.106792 -0.093694 -0.242689 -0.240665 0.433379 0.434025 0.138652 -0.122935 -0.125141 -0.104183 -0.260076 -0.188672 0.537973 0.105132 0.105677 0.075753 0.106612 0.105695
polarizability: 5.71070876e+02 -1.45043429e+01 4.11448999e+02 -1.39471747e-01 -1.55997670e+01 1.99307317e+02
1716.lowfreq: -5.9086 -2.5836 -0.0008 -0.0005 0.0004 3.3275 9.0281 34.2332 35.3421
frequency: 8.7061 34.2076 35.3300 42.8555 49.5531 65.5494 74.0329 77.9658 94.5299 111.3164 113.9087 131.9057 138.7356 146.2358 164.1231 169.7734 173.1717 192.5237 194.0938 203.6514 226.9779 259.4159 262.2076 287.6997 302.9764 316.4083 328.5742 343.9825 360.9893 366.9250 383.2178 410.2554 422.1122 437.1297 455.0050 461.0921 462.8471 477.7621 488.1105 491.3553 506.3635 529.9363 552.1961 580.5772 584.2830 593.3240 600.6775 611.1660 627.3943 629.8001 664.0588 674.1644 693.2537 705.6672 713.7097 719.6662 722.3981 761.2949 766.4376 820.6611 826.9470 828.8186 834.4682 856.9482 858.6834 887.0187 907.5313 909.4387 919.7320 927.5365 959.4028 962.4724 976.7131 978.0506 979.2906 1009.9860 1043.8790 1052.0697 1053.0094 1095.4590 1096.1435 1100.3909 1116.5928 1117.0565 1120.9546 1127.6455 1156.4619 1161.3506 1166.7418 1196.3389 1201.5447 1212.9758 1238.8627 1240.1099 1257.9795 1265.7373 1284.6705 1304.7824 1347.1200 1358.9018 1361.6025 1371.9670 1376.3337 1385.1692 1416.5833 1421.2626 1434.3025 1434.3860 1445.5015 1458.5783 1459.6132 1468.8184 1469.0335 1477.6335 1480.3960 1485.0135 1485.1476 1489.8941 1499.9051 1502.9185 1507.2860 1511.7040 1522.3795 1528.7967 1552.1749 1554.4430 1559.8460 1618.2960 1624.8835 1634.2819 1654.5809 1664.4090 2971.8070 2972.5174 2978.3028 2979.0812 3048.8585 3049.5090 3055.4047 3055.9100 3121.0057 3122.2858 3131.3464 3131.9704 3132.8233 3153.9073 3154.7022 3157.9747 3164.5874 3185.6693 3186.0584 3193.1295 3194.0348 3530.5975 3558.7148 3695.8114
redmass: 6.1834 5.0539 5.5669 3.3732 2.9218 5.0654 3.0037 3.2610 4.2456 3.9670 4.2013 1.5567 1.2272 1.1768 5.0111 4.3669 1.3360 1.9256 3.6217 4.8557 3.8087 3.6257 4.4282 5.7996 4.8935 3.8789 4.6758 3.9962 4.1573 4.3878 6.0678 2.2383 1.2100 3.4888 3.1925 3.0089 3.1014 1.2422 4.2778 5.0120 4.0394 3.6006 5.9503 3.2787 6.1387 4.9036 5.1449 1.3483 4.2537 5.2942 3.2443 6.1976 5.4814 4.6007 5.9071 6.6210 3.1688 4.5322 3.5227 1.5104 2.1504 3.5769 1.5159 1.6882 1.6862 4.7736 1.7124 4.7578 5.4757 5.5643 2.5304 1.3937 1.3592 1.4719 1.8053 3.9156 1.4803 1.5827 1.5847 1.2352 1.2342 2.5889 1.3486 1.3489 1.8342 2.6620 1.5938 1.6192 1.3076 2.0002 2.0411 1.9403 2.1425 2.7010 2.0511 1.5033 1.6214 2.1191 2.3564 2.0390 3.1218 3.2313 3.5013 5.7641 3.4719 3.8585 1.1519 1.1572 4.2366 1.3889 1.3129 1.0393 1.0398 1.2991 1.1495 1.0446 1.0451 1.8572 1.2969 2.2865 3.9395 2.5229 3.3734 5.1773 4.3316 4.3183 6.9824 7.4421 6.2023 4.4355 1.3120 6.9831 1.0368 1.0369 1.0382 1.0383 1.1012 1.1012 1.1026 1.1027 1.0982 1.0980 1.0962 1.0961 1.0878 1.0968 1.0894 1.0890 1.0922 1.0950 1.0944 1.0916 1.0917 1.0644 1.0457 1.1041
irintensity: 0.2617 3.6095 1.5677 1.0494 0.0140 0.2419 0.3184 0.4909 1.7348 0.4217 0.6328 0.0570 4.5204 0.0278 1.4340 3.4626 0.4814 0.2403 0.8690 5.4939 3.0809 0.7519 0.2532 2.2490 2.0748 2.6705 2.4754 1.7274 0.5543 9.9774 10.6810 9.1258 1.2531 0.4009 1.9202 0.2192 0.9350 245.7503 1.6495 12.9354 54.7700 7.5236 23.5553 0.6002 0.0629 22.3584 2.0585 110.5799 1.0832 1.9100 31.5997 1.8847 31.2148 22.9489 5.3336 1.9246 0.5921 15.2755 7.1517 1.1363 25.4110 9.0713 28.7996 1.3410 94.9251 0.2705 29.8686 6.0070 19.4570 3.0286 7.5547 0.7038 2.3599 4.6631 15.3945 236.2495 7.8238 20.2603 20.1099 0.0909 0.0111 78.1783 0.6579 0.1708 99.6646 83.4924 2.8817 6.0129 37.7534 5.9896 68.8788 6.3099 1.1363 8.8527 151.8557 27.1693 6.9548 84.7450 40.7833 95.7286 41.9450 207.8270 19.4588 26.8903 749.6825 229.7160 3.4278 11.0058 19.3740 3.8816 2.1162 0.4050 0.1985 35.1580 1.2657 24.6928 41.1306 1.7518 26.9860 366.4548 50.6697 192.9417 17.0774 123.9428 3.6013 10.4650 16.2828 580.1499 1675.5313 3.9631 355.3273 110.9788 35.4375 48.8087 188.8531 28.9459 12.5702 12.8316 28.3355 30.3423 2.0664 2.0161 30.2749 28.5378 8.3459 7.1663 1.3789 1.1267 4.8368 7.2168 5.0841 1.4597 0.6077 74.1812 167.4252 31.2106
temp: 298.150 k
press: 1.00000 atm
elementType: 8 8 8 7 7 7 6 6 6 6 6 6 6 6 6 6 6 6 6 6 6 6 6 6 6 6 6 6 6 6 1 1 1 1 1 1 1 1 1 1 1 1 1 1 1 1 1 1 1 1 1 1 1 1
symmnumber: 1
zpe: 1133744.1 jmol-1
zpe.correction: 0.431820 hartree
zpe.thermalcorrener: 0.460103 hartree
zpe.thermalcorrenthalpy: 0.461047 hartree
zpe.thermalcorrgfe: 0.371698 hartree
zpe.sumelectzpe: -1316.578325 hartree
zpe.sumelectthermal: -1316.550043 hartree
zpe.sumelectthermalent: -1316.549099 hartree
zpe.sumelectthermalfe: -1316.638447 hartree
dipole: -0.3039 -1.0692 -1.6886
dipole: 2.0216
quadrupole: -62.5429 -81.5562 -162.0174
quadrupole: -1.0564 0.3996 -6.2082
quadrupole: 39.4960 20.4826 -59.9786 -1.0564 0.3996 -6.2082
hfenergy: -1317.0101457 hartree
pointgroup: C01 [X(C24H24N3O3)]
dipole: -0.1370622 0.4059811 0.6700585 debye
polarizability: 567.0571851|27.8923607|415.3623947|-8.9712979|-15.5406818|199.4076127 unknown
InChI: InChI=1S/C24H24N3O3/c1-26(2)15-6-9-18-21(12-15)30-22-13-16(27(3)4)7-10-19(22)23(18)17-8-5-14(25)11-20(17)24(28)29/h5-13,28H,25H2,1-4H3
charge 1 multiplicity 1
54 atoms
O  -0.522483 2.374621 0.089304
O  1.261593 -3.06102 -3.030368
O  0.415838 -0.996386 -2.400363
N  4.156498 3.5224 0.038778
N  -5.274888 1.59015 0.114959
N  1.295056 -6.00852 0.99183
C  0.05367 -0.430934 0.248696
C  1.110329 0.529618 0.216749
C  -1.295281 0.036119 0.239758
C  0.807228 1.933145 0.124367
C  -1.569979 1.446734 0.151639
C  0.351319 -1.891189 0.388769
C  2.504229 0.190562 0.262389
C  -2.443193 -0.8259 0.275652
C  1.781539 2.928052 0.068007
C  -2.857815 1.977657 0.112711
C  3.16589 2.565049 0.101466
C  -3.987216 1.098763 0.155561
C  0.748383 -2.724902 -0.70293
C  3.496952 1.158119 0.208248
C  -3.736924 -0.326613 0.237441
C  0.266253 -2.487883 1.672908
C  1.057022 -4.087856 -0.500437
C  0.576576 -3.842661 1.883928
C  0.985468 -4.672409 0.796233
C  3.801634 4.951673 -0.067571
C  5.582981 3.137383 0.072443
C  0.780692 -2.155672 -2.080553
C  -6.434872 0.674619 0.149593
C  -5.512058 3.044958 0.027258
H  2.781405 -0.864665 0.34727
H  -2.279999 -1.906469 0.328095
H  1.454822 3.96655 -0.004153
H  -2.967111 3.060886 0.042192
H  4.542873 0.846587 0.248676
H  -4.575421 -1.02568 0.263013
H  -0.035739 -1.871803 2.526912
H  1.343652 -4.691879 -1.36644
H  0.505197 -4.263062 2.89357
H  3.217746 5.152515 -0.985788
H  3.210768 5.285168 0.806647
H  4.719783 5.554927 -0.108198
H  6.203306 4.042332 0.001588
H  5.843785 2.478546 -0.776739
H  5.840882 2.620743 1.015893
H  -7.361778 1.264315 0.106767
H  -6.430559 -0.016189 -0.714134
H  -6.452468 0.079163 1.081492
H  -5.084953 3.574389 0.899965
H  -6.593971 3.238793 0.006819
H  -5.0704 3.46934 -0.894328
H  1.238957 -6.431069 1.914718
H  1.584563 -6.598959 0.216429
H  1.244319 -2.637555 -3.93043
