program: Gaussian 09
title: 000040636
version: EM64L-G09RevD.01
frameworkgroup: C1[X(C8H16N2O3)]
method: RPBEPBE
basis: SDD
operation: Freq
keyword: #p
keyword: freq=noraman
keyword: PBEPBE/SDD
title: #p freq=noraman PBEPBE/SDD
converged: YES YES NO NO
title: Mulliken charges:
elementType: O O O N N C C C C C C C C H H H H H H H H H H H H H H H H
charge: -0.285523 -0.272056 -0.218622 -0.106729 0.059166 -0.020734 -0.327961 -0.352744 -0.345247 -0.675674 -0.678704 0.304257 -0.756016 0.287137 0.231097 0.216785 0.225775 0.206236 0.231497 0.205911 0.228192 0.222690 0.221992 0.215286 0.226662 0.208863 0.246579 0.251729 0.250154
chargesum: 0.00000
title: Mulliken charges with hydrogens summed into heavy atoms:
elementType: O O O N N C C C C C C C C
charge: -0.285523 -0.272056 -0.218622 -0.106729 0.059166 0.266403 0.119921 0.079267 0.092161 -0.002800 -0.027893 0.304257 -0.007554
polarizability: 1.13996319e+02 -2.82181945e+00 1.17877654e+02 4.25167167e+00 -8.30973363e+00 1.07049991e+02
1716.lowfreq: -16.7309 -13.9596 -7.9105 -0.0009 -0.0008 -0.0002 14.4204 20.8759 42.4782
frequency: 9.7279 20.7888 42.2530 44.5694 63.8590 75.9868 87.8598 96.1993 143.3610 181.5691 225.9736 228.1046 230.9930 261.1632 287.6861 300.5090 330.9601 369.3860 447.8402 487.7812 542.3049 562.9472 605.6436 699.6676 740.6046 748.5202 816.5509 843.9009 856.9262 893.2363 908.1465 935.5466 981.6799 1000.0555 1040.2283 1050.7265 1052.0066 1088.6315 1108.7864 1136.6060 1171.9045 1180.1857 1203.4932 1253.3216 1258.9306 1301.4120 1303.4690 1311.7050 1327.1293 1355.5220 1358.9991 1377.6586 1382.9726 1392.3441 1393.3620 1450.6715 1452.0895 1454.3726 1457.3248 1473.7614 1474.2824 1480.2193 1485.0589 1485.3412 1670.3717 2977.0262 2988.4764 2995.2459 2999.2647 3005.9361 3016.4712 3025.4642 3045.6285 3052.7472 3070.6311 3081.6573 3085.2297 3089.6150 3094.2750 3094.6989 3143.5985
redmass: 5.4305 5.2312 2.4925 1.2877 1.9206 2.3290 3.3319 2.6728 2.5034 2.5858 1.1578 1.6178 3.2607 3.5125 3.3130 5.3985 4.2314 3.5574 3.1683 4.5006 4.8931 3.4442 5.0831 5.5519 1.1601 1.5399 2.9729 2.5252 1.3762 1.8391 3.7150 2.2884 2.1357 2.4592 1.6650 2.7706 2.5164 1.8735 2.1806 2.2623 2.2822 3.1426 3.5761 1.2342 1.3285 1.3924 1.2844 1.2823 1.4915 2.2969 1.4423 1.6187 1.2449 1.2106 1.2089 1.0686 1.0689 1.0498 1.0789 1.0602 1.0423 1.0419 1.0713 1.0552 9.8096 1.0360 1.0358 1.0610 1.0600 1.0375 1.0593 1.0843 1.1001 1.1002 1.1016 1.0989 1.0999 1.1053 1.0964 1.1005 1.1011
irintensity: 1.2483 1.5582 0.1972 1.4221 0.2338 1.0605 1.2285 0.2910 2.8985 0.3226 0.4377 1.6719 11.0781 1.8100 0.3882 2.1003 2.9167 1.5700 7.0789 10.0233 11.4200 4.3571 5.1125 14.8644 13.3073 12.4318 2.7744 6.6680 24.7719 19.5992 111.1217 90.2960 106.7950 87.3734 9.5291 8.4888 8.9282 20.2267 5.0008 38.8572 18.5524 217.3701 56.7025 4.7800 23.7381 20.4133 41.0036 0.2952 9.1922 30.0492 13.0263 6.8582 58.9526 13.6059 12.5715 20.6874 5.4743 18.3485 7.1852 1.9869 13.8050 13.2505 9.6271 19.3166 164.1984 33.1456 28.3436 16.6733 9.1725 2.2145 41.6833 8.6252 0.6754 5.4184 18.1658 35.7405 34.9497 53.9728 7.9447 38.6289 8.3061
temp: 298.150 k
press: 1.00000 atm
elementType: 8 8 8 7 7 6 6 6 6 6 6 6 6 1 1 1 1 1 1 1 1 1 1 1 1 1 1 1 1
symmnumber: 1
zpe: 626670.7 jmol-1
zpe.correction: 0.238686 hartree
zpe.thermalcorrener: 0.255132 hartree
zpe.thermalcorrenthalpy: 0.256076 hartree
zpe.thermalcorrgfe: 0.190864 hartree
zpe.sumelectzpe: -648.514296 hartree
zpe.sumelectthermal: -648.497850 hartree
zpe.sumelectthermalent: -648.496906 hartree
zpe.sumelectthermalfe: -648.562118 hartree
dipole: -0.7904 2.9639 -5.1460
dipole: 5.9909
quadrupole: -73.7427 -78.4248 -88.6526
quadrupole: -1.4911 -2.6970 6.1765
quadrupole: 6.5306 1.8486 -8.3792 -1.4911 -2.6970 6.1765
hfenergy: -648.7529822 hartree
pointgroup: C01 [X(C8H16N2O3)]
dipole: 0.2135766 1.0032468 -2.1220947 debye
polarizability: 112.4920222|-0.2813886|117.3303678|1.5713471|-10.2728865|109.1015743 unknown
InChI: InChI=1S/C8H16N2O3/c1-4-6-10(9-12)8(5-2)13-7(3)11/h8H,4-6H2,1-3H3
charge 0 multiplicity 1
29 atoms
O  1.044792 0.469155 -0.5387
O  -0.65357 -2.187435 1.897593
O  1.507375 1.060077 1.681501
N  -0.828404 -0.927944 0.030541
N  -1.449506 -1.578688 1.091486
C  0.642474 -0.899485 -0.118126
C  -1.751099 -0.257728 -0.913324
C  1.158187 -1.880022 -1.181596
C  -2.307769 1.080664 -0.37528
C  2.698482 -1.915064 -1.245821
C  -3.303461 1.716519 -1.36766
C  1.451622 1.369968 0.476126
C  1.78746 2.710246 -0.137333
H  1.059466 -1.125134 0.882461
H  -2.587214 -0.949731 -1.121365
H  -1.200456 -0.088297 -1.854841
H  0.763873 -2.880126 -0.919022
H  0.737395 -1.608822 -2.168825
H  -2.802105 0.888624 0.595238
H  -1.468186 1.774019 -0.179959
H  3.105026 -0.92676 -1.52203
H  3.130188 -2.205143 -0.270243
H  3.039931 -2.648837 -1.997193
H  -4.162153 1.04526 -1.556441
H  -3.702794 2.666745 -0.970831
H  -2.822743 1.932811 -2.340501
H  0.872231 3.177801 -0.542772
H  2.22405 3.368564 0.627194
H  2.491108 2.584466 -0.977275
