program: Gaussian 09
title: 000005332
version: EM64L-G09RevD.01
frameworkgroup: C1[X(C11H12N4O3S)]
method: RPBEPBE
basis: SDD
operation: Freq
keyword: #p
keyword: freq=noraman
keyword: PBEPBE/SDD
title: #p freq=noraman PBEPBE/SDD
converged: YES YES NO NO
title: Mulliken charges:
elementType: S O O O N N N N C C C C C C C C C C C H H H H H H H H H H H H
charge: 0.983410 -0.549555 -0.488243 -0.259618 -0.640386 -0.090041 -0.687502 -0.075123 -0.090957 -0.226015 -0.141268 0.360742 0.517590 -0.391299 -0.410165 -0.424505 0.246607 -0.345104 -0.507652 0.345361 0.285359 0.287176 0.231457 0.231076 0.254517 0.315116 0.315799 0.239739 0.230839 0.242100 0.240546
chargesum: 0.00000
title: Mulliken charges with hydrogens summed into heavy atoms:
elementType: S O O O N N N N C C C C C C C C C C C
charge: 0.983410 -0.549555 -0.488243 -0.259618 -0.295025 -0.090041 -0.056587 -0.075123 -0.090957 0.059344 0.145908 0.360742 0.517590 -0.159842 -0.179089 -0.169989 0.246607 -0.105365 0.205834
polarizability: 2.71949199e+02 -1.16474379e+01 1.86773436e+02 -1.10527216e+01 -2.05326251e+01 1.33725356e+02
1716.lowfreq: -6.7561 -3.3707 -0.0022 -0.0002 0.0005 9.1250 18.1545 36.0123 54.3904
frequency: 18.1139 35.9921 54.3798 65.2380 86.2673 101.3794 126.8619 136.9200 150.4994 189.2991 206.2409 221.3444 230.4066 237.5773 256.8559 297.2288 323.7880 399.0179 403.5982 411.2172 413.7073 417.2507 434.3770 447.9817 459.6643 480.8465 518.6020 578.0121 601.0412 609.9529 623.1586 662.0284 688.3018 718.7081 751.9114 795.8723 801.0971 810.1600 815.5293 833.5089 848.7412 896.4480 927.5332 943.0831 947.0972 952.3704 966.0230 980.2195 990.0544 1021.7077 1049.8434 1111.7528 1131.9517 1135.9806 1159.0921 1184.9358 1240.4643 1258.1473 1297.1504 1302.3916 1323.2326 1327.8184 1396.1886 1402.4734 1427.4626 1436.6131 1449.2001 1453.2455 1463.4605 1489.9508 1501.2691 1559.7344 1586.4337 1613.4247 1647.8405 3005.1170 3108.7799 3135.4265 3138.2587 3143.6752 3155.5138 3166.1210 3181.8887 3183.1719 3505.9020 3562.3950 3701.3280
redmass: 5.7048 4.5626 4.5270 4.6362 6.4340 3.9550 1.1726 6.7842 5.3189 6.2160 10.0135 5.1146 7.2787 7.2995 6.2337 6.1412 5.8878 4.5506 3.6001 1.1371 2.3711 7.8365 1.3579 2.7952 4.2257 1.5701 2.6963 4.5872 6.5186 8.4062 6.9501 11.4716 3.6721 2.9140 3.3141 6.5371 6.0947 1.3088 8.1465 1.8346 1.7431 5.1322 9.9918 1.4436 1.4451 7.8564 1.3899 5.2181 3.7110 1.4420 2.4903 1.2517 1.2027 1.4437 1.4551 1.1176 3.7386 3.9468 2.4426 1.2963 2.5801 1.8437 1.8987 5.0767 2.2831 3.7619 1.0543 1.8977 1.0569 2.9168 7.1389 6.5812 7.4175 4.7896 1.2268 1.0290 1.1046 1.0896 1.0901 1.1052 1.0922 1.0957 1.0950 1.0937 1.0782 1.0452 1.1040
irintensity: 1.6515 0.7414 1.0389 0.0939 0.5312 3.6776 0.0332 0.5840 1.9026 3.6470 3.5708 12.8812 11.6427 1.5966 9.9793 19.5860 10.6292 3.2557 6.7123 4.4895 1.3831 77.8770 213.8459 96.4445 144.5150 71.1516 32.5446 102.6269 25.6008 55.6951 3.9793 33.1640 129.9688 3.0392 0.7494 11.6288 48.1718 1.5741 89.9014 84.2163 55.4348 17.7557 5.3797 6.7602 3.8342 80.0308 2.0861 9.1954 76.0519 1.5942 64.7105 0.2005 10.5716 14.6631 164.7315 46.9469 282.0200 41.5475 34.5282 5.4528 64.6307 8.3471 47.1017 8.3522 67.6689 1.5015 13.2744 13.3928 50.3957 75.8290 68.3580 910.0355 13.9596 168.2574 264.9105 54.4385 26.6310 13.5679 13.6264 25.6023 15.9940 6.8289 6.9904 0.7239 51.9161 116.8060 25.5913
temp: 298.150 k
press: 1.00000 atm
elementType: 16 8 8 8 7 7 7 7 6 6 6 6 6 6 6 6 6 6 6 1 1 1 1 1 1 1 1 1 1 1 1
symmnumber: 1
zpe: 591103.9 jmol-1
zpe.correction: 0.225140 hartree
zpe.thermalcorrener: 0.243763 hartree
zpe.thermalcorrenthalpy: 0.244707 hartree
zpe.thermalcorrgfe: 0.176953 hartree
zpe.sumelectzpe: -1267.545355 hartree
zpe.sumelectthermal: -1267.526732 hartree
zpe.sumelectthermalent: -1267.525788 hartree
zpe.sumelectthermalfe: -1267.593542 hartree
dipole: 2.2117 -6.3849 -2.8922
dipole: 7.3501
quadrupole: -80.9151 -116.9285 -119.8090
quadrupole: -20.9060 -5.6989 -8.0949
quadrupole: 24.9691 -11.0443 -13.9248 -20.9060 -5.6989 -8.0949
hfenergy: -1267.7704947 hartree
pointgroup: C01 [X(C11H12N4O3S1)]
dipole: 0.6282049 -2.8198397 0.1264335 debye
polarizability: 268.9151798|-19.9566472|164.408106|5.7961711|-35.7224347|159.124706 unknown
InChI: InChI=1S/C11H12N4O3S/c1-18-11-6-10(13-7-14-11)15-19(16,17)9-4-2-8(12)3-5-9/h2-7,15H,12H2,1H3
charge 0 multiplicity 1
31 atoms
S  1.167172 1.643402 -0.426142
O  1.919445 2.38946 -1.664089
O  0.708549 2.468457 0.888009
O  -4.968831 -0.335134 -1.320531
N  -0.329993 0.998497 -1.358873
N  -1.251101 -0.095547 0.514551
N  4.526445 -3.115543 1.173015
N  -3.582153 -0.801125 0.545593
C  2.154121 0.146058 0.057742
C  3.168377 -0.274922 -0.821828
C  1.900247 -0.472604 1.294819
C  -1.440928 0.445049 -0.743022
C  3.73975 -2.033085 0.801687
C  3.962176 -1.370939 -0.445228
C  2.70078 -1.564591 1.665315
C  -2.699423 0.394059 -1.396736
C  -3.739213 -0.260888 -0.699301
C  -2.334853 -0.676384 1.083708
C  -6.061757 -0.993032 -0.568281
H  -0.414924 1.509938 -2.245638
H  3.340068 0.258387 -1.762091
H  1.088494 -0.1111 1.931541
H  4.761536 -1.716152 -1.110623
H  2.524597 -2.064376 2.624533
H  -2.876149 0.828007 -2.382903
H  5.269225 -3.454295 0.568042
H  4.379634 -3.587876 2.060614
H  -2.195108 -1.095162 2.0854
H  -6.9284 -0.927486 -1.241781
H  -6.251352 -0.463862 0.380262
H  -5.803732 -2.042415 -0.349363
